Jump to content

[TOPIC: topicViewTemplate]
[GLOBAL: userSmallPhoto]
Photo

Could not initialize class org.codehaus.groovy.reflection.ReflectionCache
Started by supergost71 Mar 22 2020 10:08 AM

4 replies to this topic
[TOPIC CONTROLS]
[/TOPIC CONTROLS]
[modOptionsDropdown]
[/modOptionsDropdown]
[reputationFilter]
[TOPIC: post.html]
#1

supergost71

[GLOBAL: userInfoPane.html]
supergost71
  • Observer

  • 4 posts
  • Corona SDK

Hello ,i have a problem with Corona(Build:2020.3577;Windows7 64x).My project does not build.

Message in console:

19:44:37.980  
19:44:37.980  Corona Simulator 2020.3577 (Mar 13 2020 00:48:09)
19:44:37.980  
19:44:50.164  
19:44:50.164  Copyright (C) 2009-2020  C o r o n a   L a b s   I n c .
19:44:50.164  	Version: 3.0.0
19:44:50.164  	Build: 2020.3577
19:44:50.198  Platform: iPhone / x64 / 6.1 / AMD Radeon HD 8210 / 4.5.13431 Compatibility Profile Context 16.150.2211.0 / 2020.3577 / ru_RU | RU | ru_RU | ru
19:44:50.198  Loading project from:   D:\My Games\Jump Up!
19:44:50.198  Project sandbox folder: C:\Users\пользователь\AppData\Local\Corona Labs\Corona Simulator\Sandbox\jump up!-CC480F87FA8FE4308998BB644303115E\Documents
19:45:09.921  Testing credentials for 'D:\My Games\jumpup.keystore': 
19:45:23.183  Picked up JAVA_TOOL_OPTIONS: -Duser.language=en
19:45:23.183  jar signed.
19:45:25.264  Using custom build id from app bundle: 00000 (AppSettings.lua)
19:45:25.264  
19:45:25.264  Using custom Build Id 00000
19:45:25.275  Prepackage: Compiling Lua ...
19:45:25.426  Excluding specified files from build: 
19:45:25.426     excluding: LaunchScreen.storyboardc
19:45:25.426     excluding: Icon.png
19:45:25.426     excluding: Icon-*dpi.png
19:45:25.426     excluding: Images.xcassets
19:45:25.440  Prepackage: Building server data file
19:45:25.440  Prepackage: running: "C:\Program Files\Java\jdk-14\bin\java.exe" -Djava.class.path="D:\Corona Labs\Resources/ant.jar;D:\Corona Labs\Resources/ant-launcher.jar;D:\Corona Labs\Resources/AntLiveManifest.jar" org.apache.tools.ant.launch.Launcher -d -DTEMP_DIR="C:\Windows\Temp\Corona Labs\CLtmpa02144" -DSRC_DIR="D:\My Games\Jump Up!" -DBUNDLE_DIR="D:\Corona Labs\Resources" -DLIVE_BUILD=NO -DLIVE_BUILD_MANIFEST_FILE= -f "D:\Corona Labs\Resources"/build.xml build-input-zip
19:45:42.120  Picked up JAVA_TOOL_OPTIONS: -Duser.language=en
19:45:42.120  Apache Ant version 1.8.1 compiled on April 30 2010
19:45:42.120  Buildfile: D:\Corona Labs\Resources\build.xml
19:45:42.120  Adding reference: ant.PropertyHelper
19:45:42.120  Detected Java version: 1.6 in: C:\Program Files\Java\jdk-14
19:45:42.120  Detected OS: Windows 7
19:45:42.120  Adding reference: ant.ComponentHelper
19:45:42.120  Setting ro project property: LIVE_BUILD -> NO
19:45:42.120  Setting ro project property: BUNDLE_DIR -> D:\Corona Labs\Resources
19:45:42.120  Setting ro project property: TEMP_DIR -> C:\Windows\Temp\Corona Labs\CLtmpa02144
19:45:42.120  Setting ro project property: SRC_DIR -> D:\My Games\Jump Up!
19:45:42.120  Setting ro project property: LIVE_BUILD_MANIFEST_FILE -> 
19:45:42.120  Setting ro project property: ant.file -> D:\Corona Labs\Resources\build.xml
19:45:42.120  Setting ro project property: ant.file.type -> file
19:45:42.120  Adding reference: ant.projectHelper
19:45:42.120  Adding reference: ant.parsing.context
19:45:42.120  Adding reference: ant.targets
19:45:42.120  parsing buildfile D:\Corona Labs\Resources\build.xml with URI = file:/D:/Corona%20Labs/Resources/build.xml
19:45:42.120  Setting ro project property: ant.project.name -> Corona Client Build
19:45:42.120  Adding reference: Corona Client Build
19:45:42.120  Setting ro project property: ant.project.default-target -> none
19:45:42.120  Setting ro project property: ant.file.Corona Client Build -> D:\Corona Labs\Resources\build.xml
19:45:42.120  Setting ro project property: ant.file.type.Corona Client Build -> file
19:45:42.120  Project base dir set to: D:\Corona Labs\Resources
19:45:42.120   +Target: 
19:45:42.120   +Target: generate-live-build-manifest
19:45:42.120   +Target: check-gradle-bundle
19:45:42.120   +Target: setup-gradle-builds
19:45:42.120   +Target: build-input-zip
19:45:42.120   +Target: unzip-apk-template
19:45:42.120   +Target: find-main-application-icons
19:45:42.120   +Target: find-main-application-banner
19:45:42.120   +Target: find-ouya-application-icon
19:45:42.120   +Target: find-ouya-xiaomi-application-icon
19:45:42.120   +Target: find-default-notification-icons
19:45:42.120   +Target: copy-file
19:45:42.120   +Target: can-copy-file
19:45:42.120   +Target: delete-file
19:45:42.120   +Target: can-delete-file
19:45:42.120   +Target: insert-main-application-icons
19:45:42.120   +Target: insert-main-application-banner
19:45:42.120   +Target: insert-ouya-application-icon
19:45:42.120   +Target: insert-ouya-xiaomi-application-icon
19:45:42.120   +Target: insert-default-notification-icons
19:45:42.120   +Target: insert-assets-multi-icon
19:45:42.120   +Target: copy-apk-assets
19:45:42.120   +Target: copy-files-to-apk
19:45:42.120   +Target: sign-apk
19:45:42.120   +Target: sign-apk-md5
19:45:42.120   +Target: sign-apk-sha1
19:45:42.120   +Target: sign-apk-auto
19:45:42.120   +Target: build-unsigned-apk
19:45:42.120   +Target: build-signed-apk
19:45:42.120   +Target: build-expansion-file
19:45:42.120   +Target: copy-apk-to
19:45:42.120   +Target: copy-to
19:45:42.120   +Target: build
19:45:42.120   +Target: test-sign
19:45:42.120  Adding reference: ant.LocalProperties
19:45:42.120  parsing buildfile jar:file:/D:/Corona%20Labs/Resources/ant.jar!/org/apache/tools/ant/antlib.xml with URI = jar:file:/D:/Corona%20Labs/Resources/ant.jar!/org/apache/tools/ant/antlib.xml from a zip file
19:45:42.120   [property] Loading D:\Corona Labs\Resources\build.properties
19:45:42.120  Setting project property: ANDROID_API_VERSION -> android-8
19:45:42.120  Setting project property: ANDROID_ROOT -> /usr/local/bin/android-sdk-mac_x86
19:45:42.120  Setting project property: USER_ACTIVITY_PATH -> com/ansca/test/analyticstest
19:45:42.120  Setting project property: ANDROID_VERSION -> android-8
19:45:42.120  Setting project property: USER_ACTIVITY_PACKAGE -> com.ansca.test.analyticstest
19:45:42.120  Setting project property: ANDROID_MIN_SDK_INTEGER_VERSION -> 8
19:45:42.120  Setting project property: CORONA_ROOT -> /Volumes/Ansca/code/main
19:45:42.120  Setting project property: USER_APP_DISPLAY_NAME -> analyticstest
19:45:42.120  Override ignored for property "SRC_DIR"
19:45:42.120  Setting project property: APK_APP_NAME -> MyCoronaActivity
19:45:42.120  Class org.apache.tools.ant.taskdefs.condition.Os loaded from parent loader (parentFirst)
19:45:42.120  Condition true; setting SCRIPT_EXT to exe
19:45:42.120  Setting project property: SCRIPT_EXT -> exe
19:45:42.120  Override ignored for property "SCRIPT_EXT"
19:45:42.120  Condition true; setting USE_OLD_TOUCH to true
19:45:42.120  Setting project property: USE_OLD_TOUCH -> true
19:45:42.120  Condition true; setting onWindows to true
19:45:42.120  Setting project property: onWindows -> true
19:45:42.120  Class org.apache.tools.ant.taskdefs.condition.Equals loaded from parent loader (parentFirst)
19:45:42.120  Condition false; not setting live.build
19:45:42.120  Adding reference: asset.fileset
19:45:42.120  [available] Found: D:\Corona Labs\Native\Corona\android
19:45:42.120  Condition true; setting corona.native.android to D:\Corona Labs\Resources/../Native/Corona/android
19:45:42.120  Setting project property: corona.native.android -> D:\Corona Labs\Resources/../Native/Corona/android
19:45:42.120  [available] Unable to find ..\..\..\Native\Corona\android
19:45:42.120  Condition false; not setting corona.native.android
19:45:42.120  [available] Unable to find ..\..\..\..\..\android
19:45:42.120  Condition false; not setting corona.native.android
19:45:42.120  [available] Unable to find C:\Users\            \Library\Application Support\Corona\Native\Corona\android
19:45:42.120  Condition false; not setting corona.native.android
19:45:42.120   +Datatype copy-res-file org.apache.tools.ant.taskdefs.MacroInstance
19:45:42.120   [macrodef] creating macro  copy-res-file
19:45:42.120   +Datatype copy-drawable-file org.apache.tools.ant.taskdefs.MacroInstance
19:45:42.120   [macrodef] creating macro  copy-drawable-file
19:45:42.120   +Datatype copy-mipmap-file org.apache.tools.ant.taskdefs.MacroInstance
19:45:42.120   [macrodef] creating macro  copy-mipmap-file
19:45:42.120   +Datatype copy-notification-icon org.apache.tools.ant.taskdefs.MacroInstance
19:45:42.120   [macrodef] creating macro  copy-notification-icon
19:45:42.145  Setting ro project property: ant.project.invoked-targets -> build-input-zip
19:45:42.145  Attempting to create object of type org.apache.tools.ant.helper.DefaultExecutor
19:45:42.145  Adding reference: ant.executor
19:45:42.145  Build sequence for target(s) `build-input-zip' is [generate-live-build-manifest, check-gradle-bundle, setup-gradle-builds, build-input-zip]
19:45:42.145  Complete build sequence is [generate-live-build-manifest, check-gradle-bundle, setup-gradle-builds, build-input-zip, can-delete-file, unzip-apk-template, build-unsigned-apk, sign-apk-md5, sign-apk-sha1, can-copy-file, build-signed-apk, copy-files-to-apk, copy-apk-assets, test-sign, find-ouya-xiaomi-application-icon, insert-ouya-xiaomi-application-icon, copy-apk-to, sign-apk-auto, sign-apk, find-main-application-banner, insert-main-application-banner, find-main-application-icons, insert-main-application-icons, find-default-notification-icons, insert-default-notification-icons, insert-assets-multi-icon, build-expansion-file, copy-to, build, find-ouya-application-icon, insert-ouya-application-icon, copy-file, , delete-file]
19:45:42.145  
19:45:42.145  generate-live-build-manifest:
19:45:42.145  Skipped because property 'live.build' not set.
19:45:42.145  
19:45:42.145  check-gradle-bundle:
19:45:42.145  [available] Found: D:\Corona Labs\Native\Corona\android\resource\android-template.zip
19:45:42.145  Setting project property: gradle.bundle.exists -> true
19:45:42.145  
19:45:42.145  setup-gradle-builds:
19:45:42.145      [unzip] Expanding: D:\Corona Labs\Native\Corona\android\resource\android-template.zip into C:\Windows\Temp\Corona Labs\CLtmpa02144
19:45:42.145      [unzip] extracting template/gradlew.bat
19:45:42.145      [unzip] expanding template/gradlew.bat to C:\Windows\Temp\Corona Labs\CLtmpa02144\template\gradlew.bat
19:45:42.145      [unzip] extracting template/setup.sh
19:45:42.145      [unzip] expanding template/setup.sh to C:\Windows\Temp\Corona Labs\CLtmpa02144\template\setup.sh
19:45:42.145      [unzip] extracting template/gradle.properties
19:45:42.145      [unzip] expanding template/gradle.properties to C:\Windows\Temp\Corona Labs\CLtmpa02144\template\gradle.properties
19:45:42.145      [unzip] extracting template/app/
19:45:42.145      [unzip] expanding template/app/ to C:\Windows\Temp\Corona Labs\CLtmpa02144\template\app
19:45:42.145      [unzip] extracting template/app/build.gradle.kts
19:45:42.145      [unzip] expanding template/app/build.gradle.kts to C:\Windows\Temp\Corona Labs\CLtmpa02144\template\app\build.gradle.kts
19:45:42.145      [unzip] extracting template/gradle/wrapper/gradle-wrapper.properties
19:45:42.145      [unzip] expanding template/gradle/wrapper/gradle-wrapper.properties to C:\Windows\Temp\Corona Labs\CLtmpa02144\template\gradle\wrapper\gradle-wrapper.properties
19:45:42.145      [unzip] extracting template/app/src/main/
19:45:42.145      [unzip] expanding template/app/src/main/ to C:\Windows\Temp\Corona Labs\CLtmpa02144\template\app\src\main
19:45:42.145      [unzip] extracting sdk/licenses/android-sdk-license
19:45:42.145      [unzip] expanding sdk/licenses/android-sdk-license to C:\Windows\Temp\Corona Labs\CLtmpa02144\sdk\licenses\android-sdk-license
19:45:42.145      [unzip] extracting template/app/buildTools/strings.xml
19:45:42.145      [unzip] expanding template/app/buildTools/strings.xml to C:\Windows\Temp\Corona Labs\CLtmpa02144\template\app\buildTools\strings.xml
19:45:42.145      [unzip] extracting template/app/_corona_splash_screen.png
19:45:42.145      [unzip] expanding template/app/_corona_splash_screen.png to C:\Windows\Temp\Corona Labs\CLtmpa02144\template\app\_corona_splash_screen.png
19:45:42.145      [unzip] extracting template/app/src/main/res/values/
19:45:42.145      [unzip] expanding template/app/src/main/res/values/ to C:\Windows\Temp\Corona Labs\CLtmpa02144\template\app\src\main\res\values
19:45:42.145      [unzip] extracting template/
19:45:42.145      [unzip] expanding template/ to C:\Windows\Temp\Corona Labs\CLtmpa02144\template
19:45:42.145      [unzip] extracting sdk/
19:45:42.145      [unzip] expanding sdk/ to C:\Windows\Temp\Corona Labs\CLtmpa02144\sdk
19:45:42.145      [unzip] extracting template/gradlew
19:45:42.145      [unzip] expanding template/gradlew to C:\Windows\Temp\Corona Labs\CLtmpa02144\template\gradlew
19:45:42.145      [unzip] extracting template/app/proguard-rules.pro
19:45:42.145      [unzip] expanding template/app/proguard-rules.pro to C:\Windows\Temp\Corona Labs\CLtmpa02144\template\app\proguard-rules.pro
19:45:42.145      [unzip] extracting template/app/buildTools/update_manifest.lua
19:45:42.145      [unzip] expanding template/app/buildTools/update_manifest.lua to C:\Windows\Temp\Corona Labs\CLtmpa02144\template\app\buildTools\update_manifest.lua
19:45:42.145      [unzip] extracting template/app/buildTools/convert_metadata.lua
19:45:42.145      [unzip] expanding template/app/buildTools/convert_metadata.lua to C:\Windows\Temp\Corona Labs\CLtmpa02144\template\app\buildTools\convert_metadata.lua
19:45:42.145      [unzip] extracting template/app/src/main/res/
19:45:42.145      [unzip] expanding template/app/src/main/res/ to C:\Windows\Temp\Corona Labs\CLtmpa02144\template\app\src\main\res
19:45:42.145      [unzip] extracting template/gradle/wrapper/
19:45:42.145      [unzip] expanding template/gradle/wrapper/ to C:\Windows\Temp\Corona Labs\CLtmpa02144\template\gradle\wrapper
19:45:42.145      [unzip] extracting template/gradle/wrapper/gradle-wrapper.jar
19:45:42.145      [unzip] expanding template/gradle/wrapper/gradle-wrapper.jar to C:\Windows\Temp\Corona Labs\CLtmpa02144\template\gradle\wrapper\gradle-wrapper.jar
19:45:42.145      [unzip] extracting template/settings.gradle.kts
19:45:42.145      [unzip] expanding template/settings.gradle.kts to C:\Windows\Temp\Corona Labs\CLtmpa02144\template\settings.gradle.kts
19:45:42.145      [unzip] extracting template/app/src/
19:45:42.145      [unzip] expanding template/app/src/ to C:\Windows\Temp\Corona Labs\CLtmpa02144\template\app\src
19:45:42.145      [unzip] extracting template/gradle/
19:45:42.145      [unzip] expanding template/gradle/ to C:\Windows\Temp\Corona Labs\CLtmpa02144\template\gradle
19:45:42.145      [unzip] extracting template/app/src/main/res/values/strings.xml
19:45:42.145      [unzip] expanding template/app/src/main/res/values/strings.xml to C:\Windows\Temp\Corona Labs\CLtmpa02144\template\app\src\main\res\values\strings.xml
19:45:42.145      [unzip] extracting template/app/buildTools/
19:45:42.145      [unzip] expanding template/app/buildTools/ to C:\Windows\Temp\Corona Labs\CLtmpa02144\template\app\buildTools
19:45:42.145      [unzip] extracting template/build.gradle.kts
19:45:42.145      [unzip] expanding template/build.gradle.kts to C:\Windows\Temp\Corona Labs\CLtmpa02144\template\build.gradle.kts
19:45:42.145      [unzip] extracting template/app/libs/licensing-google.jar
19:45:42.145      [unzip] expanding template/app/libs/licensing-google.jar to C:\Windows\Temp\Corona Labs\CLtmpa02144\template\app\libs\licensing-google.jar
19:45:42.145      [unzip] extracting template/app/buildTools/AndroidManifest.template.xml
19:45:42.145      [unzip] expanding template/app/buildTools/AndroidManifest.template.xml to C:\Windows\Temp\Corona Labs\CLtmpa02144\template\app\buildTools\AndroidManifest.template.xml
19:45:42.145      [unzip] extracting template/app/libs/
19:45:42.145      [unzip] expanding template/app/libs/ to C:\Windows\Temp\Corona Labs\CLtmpa02144\template\app\libs
19:45:42.145      [unzip] extracting sdk/licenses/
19:45:42.145      [unzip] expanding sdk/licenses/ to C:\Windows\Temp\Corona Labs\CLtmpa02144\sdk\licenses
19:45:42.145      [unzip] extracting template/setup.bat
19:45:42.145      [unzip] expanding template/setup.bat to C:\Windows\Temp\Corona Labs\CLtmpa02144\template\setup.bat
19:45:42.145      [unzip] extracting template/app/src/main/AndroidManifest.xml
19:45:42.145      [unzip] expanding template/app/src/main/AndroidManifest.xml to C:\Windows\Temp\Corona Labs\CLtmpa02144\template\app\src\main\AndroidManifest.xml
19:45:42.145      [unzip] expand complete
19:45:42.145  fileset: Setup scanner in dir D:\Corona Labs\Native\Corona\android\lib\gradle with patternSet{ includes: [] excludes: [] }
19:45:42.145       [copy] Corona.aar added as Corona.aar doesn't exist.
19:45:42.145       [copy]  added as  is outdated.
19:45:42.145       [copy] Copying 1 file to C:\Windows\Temp\Corona Labs\CLtmpa02144\template\app\libs
19:45:42.145       [copy] Copying D:\Corona Labs\Native\Corona\android\lib\gradle\Corona.aar to C:\Windows\Temp\Corona Labs\CLtmpa02144\template\app\libs\Corona.aar
19:45:42.145  
19:45:42.145  build-input-zip:
19:45:42.145  Setting project property: USER_ZIP -> C:\Windows\Temp\Corona Labs\CLtmpa02144/input.zip
19:45:42.145  fileset: Setup scanner in dir C:\Windows\Temp\Corona Labs\CLtmpa02144 with patternSet{ includes: [] excludes: [resource.car] }
19:45:42.145        [zip] Building zip: C:\Windows\Temp\Corona Labs\CLtmpa02144\input.zip
19:45:42.145        [zip] adding directory sdk/
19:45:42.145        [zip] adding directory sdk/licenses/
19:45:42.145        [zip] adding directory template/
19:45:42.145        [zip] adding directory template/app/
19:45:42.145        [zip] adding directory template/app/buildTools/
19:45:42.145        [zip] adding directory template/app/libs/
19:45:42.145        [zip] adding directory template/app/src/
19:45:42.145        [zip] adding directory template/app/src/main/
19:45:42.145        [zip] adding directory template/app/src/main/res/
19:45:42.145        [zip] adding directory template/app/src/main/res/values/
19:45:42.145        [zip] adding directory template/gradle/
19:45:42.145        [zip] adding directory template/gradle/wrapper/
19:45:42.145        [zip] adding entry build.properties
19:45:42.145        [zip] adding entry config.lu
19:45:42.145        [zip] adding entry excludesfile.properties
19:45:42.145        [zip] adding entry game.lu
19:45:42.145        [zip] adding entry gameover.lu
19:45:42.145        [zip] adding entry head.lu
19:45:42.145        [zip] adding entry main.lu
19:45:42.145        [zip] adding entry sdk/licenses/android-sdk-license
19:45:42.145        [zip] adding entry start.lu
19:45:42.145        [zip] adding entry template/app/_corona_splash_screen.png
19:45:42.145        [zip] adding entry template/app/build.gradle.kts
19:45:42.145        [zip] adding entry template/app/buildTools/AndroidManifest.template.xml
19:45:42.145        [zip] adding entry template/app/buildTools/convert_metadata.lua
19:45:42.145        [zip] adding entry template/app/buildTools/strings.xml
19:45:42.145        [zip] adding entry template/app/buildTools/update_manifest.lua
19:45:42.145        [zip] adding entry template/app/libs/Corona.aar
19:45:42.145        [zip] adding entry template/app/libs/licensing-google.jar
19:45:42.145        [zip] adding entry template/app/proguard-rules.pro
19:45:42.145        [zip] adding entry template/app/src/main/AndroidManifest.xml
19:45:42.145        [zip] adding entry template/app/src/main/res/values/strings.xml
19:45:42.145        [zip] adding entry template/build.gradle.kts
19:45:42.145        [zip] adding entry template/gradle.properties
19:45:42.145        [zip] adding entry template/gradle/wrapper/gradle-wrapper.jar
19:45:42.145        [zip] adding entry template/gradle/wrapper/gradle-wrapper.properties
19:45:42.145        [zip] adding entry template/gradlew
19:45:42.145        [zip] adding entry template/gradlew.bat
19:45:42.145        [zip] adding entry template/settings.gradle.kts
19:45:42.145        [zip] adding entry template/setup.bat
19:45:42.145        [zip] adding entry template/setup.sh
19:45:42.145        [zip] adding entry upgrade.lu
19:45:42.145  
19:45:42.145  BUILD SUCCESSFUL
19:45:42.145  Total time: 13 seconds
19:45:42.160  DeviceBuildData: {"isLaunchPadActive":false,"targetCertType":"distribution","targetPlatformVersion":140300,"debugBuildProcess":5,"targetDevice":0,"dailyBuildRevision":3577,"buildBucket":"ansca-templates","clientPlatform":"Win","targetAppStore":"google","targetPlatform":1,"clientDeviceId":"fb3a5538f80e2cea52f2ee29d3edf2d4","plugins":[],"dailyBuildYear":2020,"clientProductId":"basic","appName":"Jump Up!"}
19:45:42.170  Build: running: cd /d "C:\Windows\Temp\Corona Labs\CLtmpa02144" && cd template && setup.bat /T && gradlew.bat -g "C:\Windows\Temp\Corona Labs\.gradle" -Dgradle.user.home="C:\Windows\Temp\Corona Labs\.gradle" buildCoronaApp --no-daemon -PconfigureCoronaPlugins=YES -PcoronaBuild=2020.3577 -PcoronaCustomHome="C:\Windows\Temp\Corona Labs" -PcoronaResourcesDir="D:\Corona Labs\Resources" -PcoronaDstDir="C:\Users\пользователь\Documents\Corona Built Apps" -PcoronaTmpDir="C:\Windows\Temp\Corona Labs\CLtmpa02144" -PcoronaSrcDir="D:\My Games\Jump Up!" -PcoronaAppFileName="Jump Up!" -PcoronaAppPackage="com.oldtapegames.jump_up" -PcoronaVersionCode=1 -PcoronaVersionName="1.0.1" -PcoronaKeystore="D:\My Games\jumpup.keystore" -PcoronaKeystorePassword="XXXXXX" -PcoronaKeyAlias="jumpup" -PcoronaTargetStore="google" -PcoronaKeyAliasPassword="XXXXXX" -PcoronaBuildData="C:\Windows\Temp\Corona Labs\CLtmpa02144\build.data" --console=plain
19:46:56.899  @ver > NUL
19:46:56.899  Picked up JAVA_TOOL_OPTIONS: -Duser.language=en
19:46:56.899  Exception in thread "DisconnectableInputStream source reader" org.gradle.api.UncheckedIOException: java.io.IOException:                   
19:46:56.899  	at org.gradle.internal.UncheckedException.throwAsUncheckedException(UncheckedException.java:61)
19:46:56.899  	at org.gradle.internal.UncheckedException.throwAsUncheckedException(UncheckedException.java:41)
19:46:56.899  	at org.gradle.util.DisconnectableInputStream$1.run(DisconnectableInputStream.java:125)
19:46:56.899  	at java.base/java.lang.Thread.run(Thread.java:832)
19:46:56.899  Caused by: java.io.IOException:                   
19:46:56.899  	at java.base/java.io.FileInputStream.readBytes(Native Method)
19:46:56.899  	at java.base/java.io.FileInputStream.read(FileInputStream.java:272)
19:46:56.899  	at java.base/java.io.BufferedInputStream.fill(BufferedInputStream.java:244)
19:46:56.899  	at java.base/java.io.BufferedInputStream.read1(BufferedInputStream.java:284)
19:46:56.899  	at java.base/java.io.BufferedInputStream.read(BufferedInputStream.java:343)
19:46:56.899  	at org.gradle.util.DisconnectableInputStream$1.run(DisconnectableInputStream.java:96)
19:46:56.899  	... 1 more
19:46:56.899  java.lang.NoClassDefFoundError: Could not initialize class org.codehaus.groovy.vmplugin.v7.Java7
19:46:56.899  	at org.codehaus.groovy.vmplugin.VMPluginFactory.<clinit>(VMPluginFactory.java:43)
19:46:56.899  	at org.codehaus.groovy.reflection.GroovyClassValueFactory.<clinit>(GroovyClassValueFactory.java:35)
19:46:56.899  	at org.codehaus.groovy.reflection.ClassInfo.<clinit>(ClassInfo.java:109)
19:46:56.899  	at org.codehaus.groovy.reflection.ReflectionCache.getCachedClass(ReflectionCache.java:95)
19:46:56.899  	at org.codehaus.groovy.reflection.ReflectionCache.<clinit>(ReflectionCache.java:39)
19:46:56.899  	at org.codehaus.groovy.runtime.metaclass.MetaClassRegistryImpl.registerMethods(MetaClassRegistryImpl.java:209)
19:46:56.899  	at org.codehaus.groovy.runtime.metaclass.MetaClassRegistryImpl.<init>(MetaClassRegistryImpl.java:107)
19:46:56.899  	at org.codehaus.groovy.runtime.metaclass.MetaClassRegistryImpl.<init>(MetaClassRegistryImpl.java:85)
19:46:56.899  	at groovy.lang.GroovySystem.<clinit>(GroovySystem.java:36)
19:46:56.899  	at org.codehaus.groovy.runtime.InvokerHelper.<clinit>(InvokerHelper.java:86)
19:46:56.899  	at groovy.lang.GroovyObjectSupport.getDefaultMetaClass(GroovyObjectSupport.java:59)
19:46:56.899  	at groovy.lang.GroovyObjectSupport.<init>(GroovyObjectSupport.java:32)
19:46:56.899  	at org.gradle.internal.extensibility.DefaultExtraPropertiesExtension.<init>(DefaultExtraPropertiesExtension.java:29)
19:46:56.899  	at org.gradle.internal.extensibility.DefaultConvention.<init>(DefaultConvention.java:48)
19:46:56.899  	at org.gradle.api.internal.plugins.DefaultConvention.<init>(DefaultConvention.java:28)
19:46:56.899  	at org.gradle.internal.extensibility.ExtensibleDynamicObject.<init>(ExtensibleDynamicObject.java:60)
19:46:56.899  	at org.gradle.internal.instantiation.MixInExtensibleDynamicObject.<init>(MixInExtensibleDynamicObject.java:34)
19:46:56.899  	at org.gradle.initialization.DefaultSettings_Decorated.getAsDynamicObject(Unknown Source)
19:46:56.899  	at org.gradle.initialization.SettingsFactory.createSettings(SettingsFactory.java:58)
19:46:56.899  	at org.gradle.initialization.ScriptEvaluatingSettingsProcessor.process(ScriptEvaluatingSettingsProcessor.java:60)
19:46:56.899  	at org.gradle.initialization.PropertiesLoadingSettingsProcessor.process(PropertiesLoadingSettingsProcessor.java:37)
19:46:56.899  	at org.gradle.initialization.SettingsEvaluatedCallbackFiringSettingsProcessor.process(SettingsEvaluatedCallbackFiringSettingsProcessor.java:34)
19:46:56.899  	at org.gradle.initialization.RootBuildCacheControllerSettingsProcessor.process(RootBuildCacheControllerSettingsProcessor.java:36)
19:46:56.899  	at org.gradle.initialization.BuildOperationSettingsProcessor$2.call(BuildOperationSettingsProcessor.java:50)
19:46:56.899  	at org.gradle.initialization.BuildOperationSettingsProcessor$2.call(BuildOperationSettingsProcessor.java:47)
19:46:56.899  	at org.gradle.internal.operations.DefaultBuildOperationExecutor$CallableBuildOperationWorker.execute(DefaultBuildOperationExecutor.java:416)
19:46:56.899  	at org.gradle.internal.operations.DefaultBuildOperationExecutor$CallableBuildOperationWorker.execute(DefaultBuildOperationExecutor.java:406)
19:46:56.899  	at org.gradle.internal.operations.DefaultBuildOperationExecutor$1.execute(DefaultBuildOperationExecutor.java:165)
19:46:56.899  	at org.gradle.internal.operations.DefaultBuildOperationExecutor.execute(DefaultBuildOperationExecutor.java:250)
19:46:56.899  	at org.gradle.internal.operations.DefaultBuildOperationExecutor.execute(DefaultBuildOperationExecutor.java:158)
19:46:56.899  	at org.gradle.internal.operations.DefaultBuildOperationExecutor.call(DefaultBuildOperationExecutor.java:102)
19:46:56.899  	at org.gradle.internal.operations.DelegatingBuildOperationExecutor.call(DelegatingBuildOperationExecutor.java:36)
19:46:56.899  	at org.gradle.initialization.BuildOperationSettingsProcessor.process(BuildOperationSettingsProcessor.java:47)
19:46:56.899  	at org.gradle.initialization.DefaultSettingsLoader.findSettingsAndLoadIfAppropriate(DefaultSettingsLoader.java:104)
19:46:56.899  	at org.gradle.initialization.DefaultSettingsLoader.findAndLoadSettings(DefaultSettingsLoader.java:45)
19:46:56.899  	at org.gradle.initialization.SettingsAttachingSettingsLoader.findAndLoadSettings(SettingsAttachingSettingsLoader.java:35)
19:46:56.899  	at org.gradle.internal.composite.CommandLineIncludedBuildSettingsLoader.findAndLoadSettings(CommandLineIncludedBuildSettingsLoader.java:34)
19:46:56.901  	at org.gradle.internal.composite.ChildBuildRegisteringSettingsLoader.findAndLoadSettings(ChildBuildRegisteringSettingsLoader.java:47)
19:46:56.901  	at org.gradle.internal.composite.CompositeBuildSettingsLoader.findAndLoadSettings(CompositeBuildSettingsLoader.java:35)
19:46:56.901  	at org.gradle.initialization.DefaultGradleLauncher$LoadBuild.run(DefaultGradleLauncher.java:277)
19:46:56.901  	at org.gradle.internal.operations.DefaultBuildOperationExecutor$RunnableBuildOperationWorker.execute(DefaultBuildOperationExecutor.java:402)
19:46:56.901  	at org.gradle.internal.operations.DefaultBuildOperationExecutor$RunnableBuildOperationWorker.execute(DefaultBuildOperationExecutor.java:394)
19:46:56.901  	at org.gradle.internal.operations.DefaultBuildOperationExecutor$1.execute(DefaultBuildOperationExecutor.java:165)
19:46:56.901  	at org.gradle.internal.operations.DefaultBuildOperationExecutor.execute(DefaultBuildOperationExecutor.java:250)
19:46:56.901  	at org.gradle.internal.operations.DefaultBuildOperationExecutor.execute(DefaultBuildOperationExecutor.java:158)
19:46:56.901  	at org.gradle.internal.operations.DefaultBuildOperationExecutor.run(DefaultBuildOperationExecutor.java:92)
19:46:56.901  	at org.gradle.internal.operations.DelegatingBuildOperationExecutor.run(DelegatingBuildOperationExecutor.java:31)
19:46:56.901  	at org.gradle.initialization.DefaultGradleLauncher.loadSettings(DefaultGradleLauncher.java:202)
19:46:56.901  	at org.gradle.initialization.DefaultGradleLauncher.doBuildStages(DefaultGradleLauncher.java:147)
19:46:56.901  	at org.gradle.initialization.DefaultGradleLauncher.executeTasks(DefaultGradleLauncher.java:134)
19:46:56.901  	at org.gradle.internal.invocation.GradleBuildController$1.execute(GradleBuildController.java:58)
19:46:56.901  	at org.gradle.internal.invocation.GradleBuildController$1.execute(GradleBuildController.java:55)
19:46:56.901  	at org.gradle.internal.invocation.GradleBuildController$3.create(GradleBuildController.java:82)
19:46:56.901  	at org.gradle.internal.invocation.GradleBuildController$3.create(GradleBuildController.java:75)
19:46:56.901  	at org.gradle.internal.work.DefaultWorkerLeaseService.withLocks(DefaultWorkerLeaseService.java:183)
19:46:56.901  	at org.gradle.internal.work.StopShieldingWorkerLeaseService.withLocks(StopShieldingWorkerLeaseService.java:40)
19:46:56.901  	at org.gradle.internal.invocation.GradleBuildController.doBuild(GradleBuildController.java:75)
19:46:56.901  	at org.gradle.internal.invocation.GradleBuildController.run(GradleBuildController.java:55)
19:46:56.901  	at org.gradle.tooling.internal.provider.ExecuteBuildActionRunner.run(ExecuteBuildActionRunner.java:31)
19:46:56.901  	at org.gradle.launcher.exec.ChainingBuildActionRunner.run(ChainingBuildActionRunner.java:35)
19:46:56.901  	at org.gradle.launcher.exec.BuildOutcomeReportingBuildActionRunner.run(BuildOutcomeReportingBuildActionRunner.java:58)
19:46:56.901  	at org.gradle.tooling.internal.provider.ValidatingBuildActionRunner.run(ValidatingBuildActionRunner.java:32)
19:46:56.901  	at org.gradle.launcher.exec.BuildCompletionNotifyingBuildActionRunner.run(BuildCompletionNotifyingBuildActionRunner.java:39)
19:46:56.901  	at org.gradle.launcher.exec.RunAsBuildOperationBuildActionRunner$3.call(RunAsBuildOperationBuildActionRunner.java:51)
19:46:56.901  	at org.gradle.launcher.exec.RunAsBuildOperationBuildActionRunner$3.call(RunAsBuildOperationBuildActionRunner.java:45)
19:46:56.901  	at org.gradle.internal.operations.DefaultBuildOperationExecutor$CallableBuildOperationWorker.execute(DefaultBuildOperationExecutor.java:416)
19:46:56.901  	at org.gradle.internal.operations.DefaultBuildOperationExecutor$CallableBuildOperationWorker.execute(DefaultBuildOperationExecutor.java:406)
19:46:56.901  	at org.gradle.internal.operations.DefaultBuildOperationExecutor$1.execute(DefaultBuildOperationExecutor.java:165)
19:46:56.901  	at org.gradle.internal.operations.DefaultBuildOperationExecutor.execute(DefaultBuildOperationExecutor.java:250)
19:46:56.901  	at org.gradle.internal.operations.DefaultBuildOperationExecutor.execute(DefaultBuildOperationExecutor.java:158)
19:46:56.901  	at org.gradle.internal.operations.DefaultBuildOperationExecutor.call(DefaultBuildOperationExecutor.java:102)
19:46:56.901  	at org.gradle.internal.operations.DelegatingBuildOperationExecutor.call(DelegatingBuildOperationExecutor.java:36)
19:46:56.901  	at org.gradle.launcher.exec.RunAsBuildOperationBuildActionRunner.run(RunAsBuildOperationBuildActionRunner.java:45)
19:46:56.901  	at org.gradle.launcher.exec.InProcessBuildActionExecuter$1.transform(InProcessBuildActionExecuter.java:49)
19:46:56.901  	at org.gradle.launcher.exec.InProcessBuildActionExecuter$1.transform(InProcessBuildActionExecuter.java:46)
19:46:56.901  	at org.gradle.composite.internal.DefaultRootBuildState.run(DefaultRootBuildState.java:78)
19:46:56.901  	at org.gradle.launcher.exec.InProcessBuildActionExecuter.execute(InProcessBuildActionExecuter.java:46)
19:46:56.901  	at org.gradle.launcher.exec.InProcessBuildActionExecuter.execute(InProcessBuildActionExecuter.java:31)
19:46:56.901  	at org.gradle.launcher.exec.BuildTreeScopeBuildActionExecuter.execute(BuildTreeScopeBuildActionExecuter.java:42)
19:46:56.901  	at org.gradle.launcher.exec.BuildTreeScopeBuildActionExecuter.execute(BuildTreeScopeBuildActionExecuter.java:28)
19:46:56.901  	at org.gradle.tooling.internal.provider.ContinuousBuildActionExecuter.execute(ContinuousBuildActionExecuter.java:78)
19:46:56.901  	at org.gradle.tooling.internal.provider.ContinuousBuildActionExecuter.execute(ContinuousBuildActionExecuter.java:52)
19:46:56.902  	at org.gradle.tooling.internal.provider.SubscribableBuildActionExecuter.execute(SubscribableBuildActionExecuter.java:59)
19:46:56.902  	at org.gradle.tooling.internal.provider.SubscribableBuildActionExecuter.execute(SubscribableBuildActionExecuter.java:36)
19:46:56.902  	at org.gradle.tooling.internal.provider.SessionScopeBuildActionExecuter.execute(SessionScopeBuildActionExecuter.java:68)
19:46:56.902  	at org.gradle.tooling.internal.provider.SessionScopeBuildActionExecuter.execute(SessionScopeBuildActionExecuter.java:38)
19:46:56.902  	at org.gradle.tooling.internal.provider.GradleThreadBuildActionExecuter.execute(GradleThreadBuildActionExecuter.java:37)
19:46:56.902  	at org.gradle.tooling.internal.provider.GradleThreadBuildActionExecuter.execute(GradleThreadBuildActionExecuter.java:26)
19:46:56.902  	at org.gradle.tooling.internal.provider.ParallelismConfigurationBuildActionExecuter.execute(ParallelismConfigurationBuildActionExecuter.java:43)
19:46:56.902  	at org.gradle.tooling.internal.provider.ParallelismConfigurationBuildActionExecuter.execute(ParallelismConfigurationBuildActionExecuter.java:29)
19:46:56.902  	at org.gradle.tooling.internal.provider.StartParamsValidatingActionExecuter.execute(StartParamsValidatingActionExecuter.java:60)
19:46:56.902  	at org.gradle.tooling.internal.provider.StartParamsValidatingActionExecuter.execute(StartParamsValidatingActionExecuter.java:32)
19:46:56.902  	at org.gradle.tooling.internal.provider.SessionFailureReportingActionExecuter.execute(SessionFailureReportingActionExecuter.java:55)
19:46:56.902  	at org.gradle.tooling.internal.provider.SessionFailureReportingActionExecuter.execute(SessionFailureReportingActionExecuter.java:41)
19:46:56.902  	at org.gradle.tooling.internal.provider.SetupLoggingActionExecuter.execute(SetupLoggingActionExecuter.java:48)
19:46:56.902  	at org.gradle.tooling.internal.provider.SetupLoggingActionExecuter.execute(SetupLoggingActionExecuter.java:32)
19:46:56.902  	at org.gradle.launcher.daemon.server.exec.ExecuteBuild.doBuild(ExecuteBuild.java:67)
19:46:56.902  	at org.gradle.launcher.daemon.server.exec.BuildCommandOnly.execute(BuildCommandOnly.java:36)
19:46:56.902  	at org.gradle.launcher.daemon.server.api.DaemonCommandExecution.proceed(DaemonCommandExecution.java:104)
19:46:56.902  	at org.gradle.launcher.daemon.server.exec.WatchForDisconnection.execute(WatchForDisconnection.java:37)
19:46:56.902  	at org.gradle.launcher.daemon.server.api.DaemonCommandExecution.proceed(DaemonCommandExecution.java:104)
19:46:56.902  	at org.gradle.launcher.daemon.server.exec.ResetDeprecationLogger.execute(ResetDeprecationLogger.java:26)
19:46:56.902  	at org.gradle.launcher.daemon.server.api.DaemonCommandExecution.proceed(DaemonCommandExecution.java:104)
19:46:56.902  	at org.gradle.launcher.daemon.server.exec.RequestStopIfSingleUsedDaemon.execute(RequestStopIfSingleUsedDaemon.java:34)
19:46:56.902  	at org.gradle.launcher.daemon.server.api.DaemonCommandExecution.proceed(DaemonCommandExecution.java:104)
19:46:56.902  	at org.gradle.launcher.daemon.server.exec.ForwardClientInput$2.call(ForwardClientInput.java:74)
19:46:56.902  	at org.gradle.launcher.daemon.server.exec.ForwardClientInput$2.call(ForwardClientInput.java:72)
19:46:56.902  	at org.gradle.util.Swapper.swap(Swapper.java:38)
19:46:56.902  	at org.gradle.launcher.daemon.server.exec.ForwardClientInput.execute(ForwardClientInput.java:72)
19:46:56.902  	at org.gradle.launcher.daemon.server.api.DaemonCommandExecution.proceed(DaemonCommandExecution.java:104)
19:46:56.902  	at org.gradle.launcher.daemon.server.exec.LogAndCheckHealth.execute(LogAndCheckHealth.java:50)
19:46:56.902  	at org.gradle.launcher.daemon.server.api.DaemonCommandExecution.proceed(DaemonCommandExecution.java:104)
19:46:56.902  	at org.gradle.launcher.daemon.server.exec.LogToClient.doBuild(LogToClient.java:62)
19:46:56.902  	at org.gradle.launcher.daemon.server.exec.BuildCommandOnly.execute(BuildCommandOnly.java:36)
19:46:56.902  	at org.gradle.launcher.daemon.server.api.DaemonCommandExecution.proceed(DaemonCommandExecution.java:104)
19:46:56.902  	at org.gradle.launcher.daemon.server.exec.EstablishBuildEnvironment.doBuild(EstablishBuildEnvironment.java:81)
19:46:56.902  	at org.gradle.launcher.daemon.server.exec.BuildCommandOnly.execute(BuildCommandOnly.java:36)
19:46:56.902  	at org.gradle.launcher.daemon.server.api.DaemonCommandExecution.proceed(DaemonCommandExecution.java:104)
19:46:56.902  	at org.gradle.launcher.daemon.server.exec.StartBuildOrRespondWithBusy$1.run(StartBuildOrRespondWithBusy.java:50)
19:46:56.902  	at org.gradle.launcher.daemon.server.DaemonStateCoordinator$1.run(DaemonStateCoordinator.java:295)
19:46:56.902  	at org.gradle.internal.concurrent.ExecutorPolicy$CatchAndRecordFailures.onExecute(ExecutorPolicy.java:63)
19:46:56.902  	at org.gradle.internal.concurrent.ManagedExecutorImpl$1.run(ManagedExecutorImpl.java:46)
19:46:56.902  	at java.base/java.util.concurrent.ThreadPoolExecutor.runWorker(ThreadPoolExecutor.java:1130)
19:46:56.902  	at java.base/java.util.concurrent.ThreadPoolExecutor$Worker.run(ThreadPoolExecutor.java:630)
19:46:56.902  	at org.gradle.internal.concurrent.ThreadFactoryImpl$ManagedThreadRunnable.run(ThreadFactoryImpl.java:55)
19:46:56.902  	at java.base/java.lang.Thread.run(Thread.java:832)
19:46:56.902  
19:46:56.902  FAILURE: Build failed with an exception.
19:46:56.902  
19:46:56.902  * What went wrong:
19:46:56.902  Could not initialize class org.codehaus.groovy.reflection.ReflectionCache
19:46:56.902  
19:46:56.902  * Try:
19:46:56.902  Run with --stacktrace option to get the stack trace. Run with --info or --debug option to get more log output. Run with --scan to get full insights.
19:46:56.902  
19:46:56.902  * Get more help at https://help.gradle.org
19:46:56.902  
19:46:56.903  BUILD FAILED in 1m 9s
19:47:09.728  Android build failed (1) after 104 seconds

What i should do?



[TOPIC: post.html]
#2

Rob Miracle

[GLOBAL: userInfoPane.html]
Rob Miracle
  • Moderator

  • 26,680 posts
  • Enterprise

Can you try moving your project to the C: Drive and see if that works. Then if it doesn't try taking the ! out of the project name.

 

Rob



[TOPIC: post.html]
#3

supergost71

[GLOBAL: userInfoPane.html]
supergost71
  • Observer

  • 4 posts
  • Corona SDK

This does not work :(



[TOPIC: post.html]
#4

carloscosta

[GLOBAL: userInfoPane.html]
carloscosta
  • Contributor

  • 688 posts
  • Corona SDK

I've the same problem.

I installed Corona in a new Machine, installed Java jdk-14, and could not made a build.

Tried all apps that worked in my older computer and none made a build.

What I'm missing?

 

after that tried install jdk-11.0.6

jre1.8.0_241.

 

Nothing worked....I remember I had this problem..and was related to java..don't remember how I solved it.

 

tried to find info how to proper installing corona and libraries it need to fully work, with no luck.

 

*edit* found:

 

https://docs.coronalabs.com/guide/start/installWin/index.html

 

it worked when I installed:

 

jdk1.8.0_241


Edited by carloscosta, 25 March 2020 - 11:34 AM.


[TOPIC: post.html]
#5

supergost71

[GLOBAL: userInfoPane.html]
supergost71
  • Observer

  • 4 posts
  • Corona SDK

Thank you,i will try it


[topic_controls]
[/topic_controls]