Jump to content

[TOPIC: topicViewTemplate]
[GLOBAL: userSmallPhoto]
Photo

USE THIS THREAD: Is the Build Server Down?
Started by bayudsava Jan 10 2020 06:59 AM

184 replies to this topic
[TOPIC CONTROLS]
« Page 8 of 8 6 7 8
This topic is locked This topic is locked
[/TOPIC CONTROLS]
[modOptionsDropdown]
[/modOptionsDropdown]
[reputationFilter]
[TOPIC: post.html]
#176

emmanuel.guerin

[GLOBAL: userInfoPane.html]
emmanuel.guerin
  • Observer

  • 29 posts
  • Corona SDK

Maybe unrelated, but while searching the forum and clicked on a linked with domain anscamobile.com, it lead me to a porn site.

 

Ben

 

Corona Labs used to be Ansca Mobile...

They should have kept their old domain name; stumbling upon a porn site doesn't contribute to spreading positive notoriety :-/



[TOPIC: post.html]
#177

Rob Miracle

[GLOBAL: userInfoPane.html]
Rob Miracle
  • Moderator

  • 26,622 posts
  • Enterprise

Sorry about that. DO NOT visit the old anscamobile website. It's NSFW.

 

Should we have let it go? Probably not, but in the various ownership transfers, culling domain names you don't use any more is a common practice.  

 

We can't fix it now, so just don't visit it.

 

Rob



[TOPIC: post.html]
#178

gamebit.labs

[GLOBAL: userInfoPane.html]
gamebit.labs
  • Contributor

  • 224 posts
  • Corona SDK

Sorry about that. DO NOT visit the old anscamobile website. It's NSFW.

 

Should we have let it go? Probably not, but in the various ownership transfers, culling domain names you don't use any more is a common practice.  

 

We can't fix it now, so just don't visit it.

 

Rob

I brought the issue up because:

 

1. why would porn site owners buy a domain called anscamobile.com, unless "ansca" relates to porn in some way.

2. i was concerned Coronalabs was hacked through something they own but have forgotten about it.



[TOPIC: post.html]
#179

yosu

[GLOBAL: userInfoPane.html]
yosu
  • Contributor

  • 542 posts
  • Corona SDK

Build seems down now. I have been trying to build on windows simulator 2019.3559 and keep on getting errors saying s3 bucket does not exist ( http://s3.amazonaws.com/52.216.147.21, http://s3.amazonaws.com/52.217.43.190).

 

Not sure whether this is related, but I notice the openssl plugin keeps on download when I re-launch my simulator. If not mistaken, the openssl file size is ~800kb.

00:38:53.319  @ver > NUL
00:38:53.319  Exception in thread "DisconnectableInputStream source reader" org.gradle.api.UncheckedIOException: java.io.IOException: Access is denied
00:38:53.319  	at org.gradle.internal.UncheckedException.throwAsUncheckedException(UncheckedException.java:61)
00:38:53.319  	at org.gradle.internal.UncheckedException.throwAsUncheckedException(UncheckedException.java:41)
00:38:53.319  	at org.gradle.util.DisconnectableInputStream$1.run(DisconnectableInputStream.java:125)
00:38:53.319  	at java.lang.Thread.run(Thread.java:748)
00:38:53.319  Caused by: java.io.IOException: Access is denied
00:38:53.319  	at java.io.FileInputStream.readBytes(Native Method)
00:38:53.319  	at java.io.FileInputStream.read(FileInputStream.java:255)
00:38:53.319  	at java.io.BufferedInputStream.fill(BufferedInputStream.java:246)
00:38:53.319  	at java.io.BufferedInputStream.read1(BufferedInputStream.java:286)
00:38:53.319  	at java.io.BufferedInputStream.read(BufferedInputStream.java:345)
00:38:53.319  	at org.gradle.util.DisconnectableInputStream$1.run(DisconnectableInputStream.java:96)
00:38:53.319  	... 1 more
00:38:53.319  ERROR: There was a problem downloading plugin 'shared.firebase.messaging_com.coronalabs'. Please, try again.
00:38:53.319  
00:38:53.319  FAILURE: Build failed with an exception.

...


00:38:53.319  * What went wrong:
00:38:53.319  Connect to s3.amazonaws.com:443 [s3.amazonaws.com/52.217.43.190] failed: Connection timed out: connect
00:38:53.319  > Connection timed out: connect


[TOPIC: post.html]
#180

i_i_i

[GLOBAL: userInfoPane.html]
i_i_i
  • Observer

  • 10 posts
  • Corona SDK

A new iOS server build error has appeared:

 

iOS build failed (5) after 12 seconds
Feb 10 12:15:03.880 ERROR: Build Failed: A device build error occurred on the server.
                    
                    Error: Template not found.
                    
                    Build Number: 2020.3573
                    Platform: iphone-sim
                    Platform Version: 13.2
                    Template Type: basic
                    BuildID: 5e413b34b065c

 



[TOPIC: post.html]
#181

bamazy

[GLOBAL: userInfoPane.html]
bamazy
  • Contributor

  • 146 posts
  • Corona SDK

I also had this error a few times but eventually I was able to build for iOS. However, I get error when uploading to the AppStore. 

ERROR ITMS-90668: "Invalid Bundle Executable. The executable file 'YolNisanlariCL.app/Frameworks/GoogleUtilities.framework/GoogleUtilities' contains incomplete bitcode. To compile binaries with complete bitcode, open Xcode and choose Archive in the Product menu."

ERROR ITMS-90668: "Invalid Bundle Executable. The executable file 'YolNisanlariCL.app/Frameworks/MoPub.framework/MoPub' contains incomplete bitcode. To compile binaries with complete bitcode, open Xcode and choose Archive in the Product menu."

ERROR ITMS-90668: "Invalid Bundle Executable. The executable file 'YolNisanlariCL.app/Frameworks/nanopb.framework/nanopb' contains incomplete bitcode. To compile binaries with complete bitcode, open Xcode and choose Archive in the Product menu."

I think it might be because of the Appodeal Beta version. Now I am trying to build with the Appodeal Public version. 



[TOPIC: post.html]
#182

Aarbron

[GLOBAL: userInfoPane.html]
Aarbron
  • Contributor

  • 200 posts
  • Corona SDK

@bamazy

Appodeal beta version for iOS makes my apps crash.

Have you tried the app before uploading to app store?



[TOPIC: post.html]
#183

bamazy

[GLOBAL: userInfoPane.html]
bamazy
  • Contributor

  • 146 posts
  • Corona SDK

@aarrbron, I haven't tested it on device before uploading to app store. Now I am uploading the build with the Appodeal public version. 



[TOPIC: post.html]
#184

d.mach

[GLOBAL: userInfoPane.html]
d.mach
  • Contributor

  • 956 posts
  • Corona SDK

I now get this error (see image) when trying to build for distribution for universal iOS

 

Attached File  coronabuilderror.png   72.73KB   0 downloads



[TOPIC: post.html]
#185

Rob Miracle

[GLOBAL: userInfoPane.html]
Rob Miracle
  • Moderator

  • 26,622 posts
  • Enterprise

Hey folks, the last few posts, while "build problems" are definitely not related to our server outages. Please open these individual issues in their own threads.

 

Thanks

Rob




[topic_controls]
« Page 8 of 8 6 7 8
 
[/topic_controls]