Jump to content

[TOPIC: topicViewTemplate]
[GLOBAL: userSmallPhoto]
Photo

Appodeal on Latest Corona Daily Build
Started by lukascoossa Nov 26 2019 04:41 PM

9 replies to this topic
appodeal
[TOPIC CONTROLS]
[/TOPIC CONTROLS]
[modOptionsDropdown]
[/modOptionsDropdown]
[reputationFilter]
[TOPIC: post.html]
#1

lukascoossa

[GLOBAL: userInfoPane.html]
lukascoossa
  • Observer

  • 7 posts
  • Corona SDK

Hello,

 

I can't seem to be able to build my app with the latest Corona Daily build. It successfully builds without the plugin, but incorporating the appodeal plugin seems to give me ERROR 256

 

The error message I get is "ERROR: configuring 'shared.google.play.services.location_com.coronalabs' failed!"

 

What does this mean, and how can I fix it?

 

Please and thanks,



[TOPIC: post.html]
#2

Rob Miracle

[GLOBAL: userInfoPane.html]
Rob Miracle
  • Moderator

  • 26,393 posts
  • Enterprise

Are you building for iOS or Android? 

Are you using Windows or macOS?

Can you post the entire console log (please use a service like pastebin.com and share the link)?

Can you post your entire build.settings?

 

Thanks

Rob



[TOPIC: post.html]
#3

lukascoossa

[GLOBAL: userInfoPane.html]
lukascoossa
  • Observer

  • 7 posts
  • Corona SDK

PluginSync: plugin com.coronalabs/plugin.appodeal.base needs to be updated for platform mac-sim to build number: 3326
                    PluginSync: downloading plugin: http://plugins.coronasphere.com/com.coronalabs/plugin.appodeal.base/2018.3326/mac-sim/plugin.appodeal.base.zip

 

This is mentioned in the console on startup

 

However, when building, this is the console log

 

Using java version "13.0.1" 2019-10-15
                    Java™ SE Runtime Environment (build 13.0.1+9)
                    Java HotSpot™ 64-Bit Server VM (build 13.0.1+9, mixed mode, sharing)
Nov 27 04:02:30.292 Building Android app for lukascoossa@gmail.com with 2019.3556
Nov 27 04:02:31.762 Using custom build id from app bundle: 00000 (AppSettings.lua)
Nov 27 04:02:35.583 BUILD SUCCESSFUL
                    Total time: 2 seconds
Nov 27 04:02:55.350 Authorization check succeeded.
Nov 27 04:03:20.250 ERROR: configuring 'shared.google.play.services.location_com.coronalabs' failed!
Nov 27 04:03:20.251
Nov 27 04:03:20.261
Nov 27 04:03:20.450
Nov 27 04:03:20.451 FAILURE: Build failed with an exception.
Nov 27 04:03:20.451 * Where:
Nov 27 04:03:20.451 Build file '/private/var/folders/pc/8jl2ybqj5szc2wvg860p32n00000gn/T/CLtmpidTXd3/template/app/build.gradle.kts' line: 277
                    
                    * What went wrong:
Nov 27 04:03:20.468 Could not open dsl remapped class cache for 7pikktvxbcqhwmu1f7o9exvba (/Users/lukas/.gradle/caches/5.4.1/scripts-remapped/corona_1cn1oq64smrqndhguvz6p41u4/7pikktvxbcqhwmu1f7o9exvba/dsldcd040730888da95d185715568c9cc57).
Nov 27 04:03:20.471 > Could not open dsl generic class cache for script '/private/var/folders/pc/8jl2ybqj5szc2wvg860p32n00000gn/T/CLtmpidTXd3/template/app/build/corona-plugins/shared.google.play.services.location_com.coronalabs/corona.gradle' (/Users/lukas/.gradle/caches/5.4.1/scripts/7pikktvxbcqhwmu1f7o9exvba/dsl/dsldcd040730888da95d185715568c9cc57).
                       > Could not compile script '/private/var/folders/pc/8jl2ybqj5szc2wvg860p32n00000gn/T/CLtmpidTXd3/template/app/build/corona-plugins/shared.google.play.services.location_com.coronalabs/corona.gradle'.
                          > startup failed:
                            General error during semantic analysis: Unsupported class file major version 57
                            
                            java.lang.IllegalArgumentException: Unsupported class file major version 57
                                at groovyjarjarasm.asm.ClassReader.<init>(ClassReader.java:184)
                                at groovyjarjarasm.asm.ClassReader.<init>(ClassReader.java:166)
                                at groovyjarjarasm.asm.ClassReader.<init>(ClassReader.java:152)
                                at groovyjarjarasm.asm.ClassReader.<init>(ClassReader.java:273)
                                at org.codehaus.groovy.ast.decompiled.AsmDecompiler.parseClass(AsmDecompiler.java:81)
                                at org.codehaus.groovy.control.ClassNodeResolver.findDecompiled(ClassNodeResolver.java:254)
                                at org.codehaus.groovy.control.ClassNodeResolver.tryAsLoaderClassOrScript(ClassNodeResolver.java:192)
                                at org.codehaus.groovy.control.ClassNodeResolver.findClassNode(ClassNodeResolver.java:172)
                                at org.codehaus.groovy.control.ClassNodeResolver.resolveName(ClassNodeResolver.java:128)
                                at org.codehaus.groovy.ast.decompiled.AsmReferenceResolver.resolveClassNullable(AsmReferenceResolver.java:59)
                                at org.codehaus.groovy.ast.decompiled.AsmReferenceResolver.resolveClass(AsmReferenceResolver.java:46)
                                at org.codehaus.groovy.ast.decompiled.AsmReferenceResolver.resolveNonArrayType(AsmReferenceResolver.java:81)
                                at org.codehaus.groovy.ast.decompiled.AsmReferenceResolver.resolveType(AsmReferenceResolver.java:72)
                                at org.codehaus.groovy.ast.decompiled.MemberSignatureParser.createMethodNode(MemberSignatureParser.java:55)
                                at org.codehaus.groovy.ast.decompiled.DecompiledClassNode.lazyInitMembers(DecompiledClassNode.java:195)
                                at org.codehaus.groovy.ast.decompiled.DecompiledClassNode.getDeclaredMethods(DecompiledClassNode.java:121)
                                at org.codehaus.groovy.ast.ClassNode.getMethods(ClassNode.java:912)
                                at org.codehaus.groovy.ast.ClassNode.tryFindPossibleMethod(ClassNode.java:1280)
                                at org.codehaus.groovy.control.StaticImportVisitor.transformMethodCallExpression(StaticImportVisitor.java:252)
                                at org.codehaus.groovy.control.StaticImportVisitor.transform(StaticImportVisitor.java:112)
                                at org.codehaus.groovy.ast.ClassCodeExpressionTransformer.visitExpressionStatement(ClassCodeExpressionTransformer.java:144)
                                at org.codehaus.groovy.ast.stmt.ExpressionStatement.visit(ExpressionStatement.java:42)
                                at org.codehaus.groovy.ast.ClassCodeVisitorSupport.visitClassCodeContainer(ClassCodeVisitorSupport.java:110)
                                at org.codehaus.groovy.ast.ClassCodeVisitorSupport.visitConstructorOrMethod(ClassCodeVisitorSupport.java:121)
                                at org.codehaus.groovy.ast.ClassCodeExpressionTransformer.visitConstructorOrMethod(ClassCodeExpressionTransformer.java:55)
                                at org.codehaus.groovy.control.StaticImportVisitor.visitConstructorOrMethod(StaticImportVisitor.java:88)
                                at org.codehaus.groovy.ast.ClassCodeVisitorSupport.visitConstructor(ClassCodeVisitorSupport.java:128)
                                at org.codehaus.groovy.ast.ClassNode.visitContents(ClassNode.java:1099)
                                at org.codehaus.groovy.ast.ClassCodeVisitorSupport.visitClass(ClassCodeVisitorSupport.java:54)
                                at org.codehaus.groovy.control.StaticImportVisitor.visitClass(StaticImportVisitor.java:82)
                                at org.codehaus.groovy.control.CompilationUnit$14.call(CompilationUnit.java:717)
                                at org.codehaus.groovy.control.CompilationUnit.applyToPrimaryClassNodes(CompilationUnit.java:1095)
                                at org.codehaus.groovy.control.CompilationUnit.doPhaseOperation(CompilationUnit.java:649)
                                at org.codehaus.groovy.control.CompilationUnit.processPhaseOperations(CompilationUnit.java:627)
                                at org.codehaus.groovy.control.CompilationUnit.compile(CompilationUnit.java:604)
                                at groovy.lang.GroovyClassLoader.doParseClass(GroovyClassLoader.java:390)
                                at groovy.lang.GroovyClassLoader.access$300(GroovyClassLoader.java:89)
                                at groovy.lang.GroovyClassLoader$5.provide(GroovyClassLoader.java:330)
                                at groovy.lang.GroovyClassLoader$5.provide(GroovyClassLoader.java:327)
                                at org.codehaus.groovy.runtime.memoize.ConcurrentCommonCache.getAndPut(ConcurrentCommonCache.java:147)
                                at groovy.lang.GroovyClassLoader.parseClass(GroovyClassLoader.java:325)
                                at org.gradle.groovy.scripts.internal.DefaultScriptCompilationHandler.compileScript(DefaultScriptCompilationHandler.java:133)
                                at org.gradle.groovy.scripts.internal.DefaultScriptCompilationHandler.compileToDir(DefaultScriptCompilationHandler.java:93)
                                at org.gradle.groovy.scripts.internal.BuildOperationBackedScriptCompilationHandler$2.run(BuildOperationBackedScriptCompilationHandler.java:54)
                                at org.gradle.internal.operations.DefaultBuildOperationExecutor$RunnableBuildOperationWorker.execute(DefaultBuildOperationExecutor.java:402)
                                at org.gradle.internal.operations.DefaultBuildOperationExecutor$RunnableBuildOperationWorker.execute(DefaultBuildOperationExecutor.java:394)
                                at org.gradle.internal.operations.DefaultBuildOperationExecutor$1.execute(DefaultBuildOperationExecutor.java:165)
                                at org.gradle.internal.operations.DefaultBuildOperationExecutor.execute(DefaultBuildOperationExecutor.java:250)
                                at org.gradle.internal.operations.DefaultBuildOperationExecutor.execute(DefaultBuildOperationExecutor.java:158)
                                at org.gradle.internal.operations.DefaultBuildOperationExecutor.run(DefaultBuildOperationExecutor.java:92)
                                at org.gradle.internal.operations.DelegatingBuildOperationExecutor.run(DelegatingBuildOperationExecutor.java:31)
                                at org.gradle.groovy.scripts.internal.BuildOperationBackedScriptCompilationHandler.compileToDir(BuildOperationBackedScriptCompilationHandler.java:51)
                                at org.gradle.groovy.scripts.internal.FileCacheBackedScriptClassCompiler$CompileToCrossBuildCacheAction.execute(FileCacheBackedScriptClassCompiler.java:151)
                                at org.gradle.groovy.scripts.internal.FileCacheBackedScriptClassCompiler$CompileToCrossBuildCacheAction.execute(FileCacheBackedScriptClassCompiler.java:132)
                                at org.gradle.groovy.scripts.internal.FileCacheBackedScriptClassCompiler$ProgressReportingInitializer.execute(FileCacheBackedScriptClassCompiler.java:175)
                                at org.gradle.groovy.scripts.internal.FileCacheBackedScriptClassCompiler$ProgressReportingInitializer.execute(FileCacheBackedScriptClassCompiler.java:155)
                                at org.gradle.cache.internal.DefaultPersistentDirectoryCache$Initializer.initialize(DefaultPersistentDirectoryCache.java:98)
                                at org.gradle.cache.internal.FixedSharedModeCrossProcessCacheAccess$1.run(FixedSharedModeCrossProcessCacheAccess.java:85)
                                at org.gradle.cache.internal.DefaultFileLockManager$DefaultFileLock.doWriteAction(DefaultFileLockManager.java:207)
                                at org.gradle.cache.internal.DefaultFileLockManager$DefaultFileLock.writeFile(DefaultFileLockManager.java:197)
                                at org.gradle.cache.internal.FixedSharedModeCrossProcessCacheAccess.open(FixedSharedModeCrossProcessCacheAccess.java:83)
                                at org.gradle.cache.internal.DefaultCacheAccess.open(DefaultCacheAccess.java:142)
                                at org.gradle.cache.internal.DefaultPersistentDirectoryStore.open(DefaultPersistentDirectoryStore.java:78)
                                at org.gradle.cache.internal.DefaultPersistentDirectoryStore.open(DefaultPersistentDirectoryStore.java:42)
                                at org.gradle.cache.internal.DefaultCacheFactory.doOpen(DefaultCacheFactory.java:94)
                                at org.gradle.cache.internal.DefaultCacheFactory.open(DefaultCacheFactory.java:68)
                                at org.gradle.cache.internal.DefaultCacheRepository$PersistentCacheBuilder.open(DefaultCacheRepository.java:118)
                                at org.gradle.groovy.scripts.internal.FileCacheBackedScriptClassCompiler$RemapBuildScriptsAction.execute(FileCacheBackedScriptClassCompiler.java:421)
                                at org.gradle.groovy.scripts.internal.FileCacheBackedScriptClassCompiler$RemapBuildScriptsAction.execute(FileCacheBackedScriptClassCompiler.java:390)
                                at org.gradle.groovy.scripts.internal.FileCacheBackedScriptClassCompiler$ProgressReportingInitializer.execute(FileCacheBackedScriptClassCompiler.java:175)
                                at org.gradle.groovy.scripts.internal.FileCacheBackedScriptClassCompiler$ProgressReportingInitializer.execute(FileCacheBackedScriptClassCompiler.java:155)
                                at org.gradle.cache.internal.DefaultPersistentDirectoryCache$Initializer.initialize(DefaultPersistentDirectoryCache.java:98)
                                at org.gradle.cache.internal.FixedSharedModeCrossProcessCacheAccess$1.run(FixedSharedModeCrossProcessCacheAccess.java:85)
                                at org.gradle.cache.internal.DefaultFileLockManager$DefaultFileLock.doWriteAction(DefaultFileLockManager.java:207)
                                at org.gradle.cache.internal.DefaultFileLockManager$DefaultFileLock.writeFile(DefaultFileLockManager.java:197)
                                at org.gradle.cache.internal.FixedSharedModeCrossProcessCacheAccess.open(FixedSharedModeCrossProcessCacheAccess.java:83)
                                at org.gradle.cache.internal.DefaultCacheAccess.open(DefaultCacheAccess.java:142)
                                at org.gradle.cache.internal.DefaultPersistentDirectoryStore.open(DefaultPersistentDirectoryStore.java:78)
                                at org.gradle.cache.internal.DefaultPersistentDirectoryStore.open(DefaultPersistentDirectoryStore.java:42)
                                at org.gradle.cache.internal.DefaultCacheFactory.doOpen(DefaultCacheFactory.java:94)
                                at org.gradle.cache.internal.DefaultCacheFactory.open(DefaultCacheFactory.java:68)
                                at org.gradle.cache.internal.DefaultCacheRepository$PersistentCacheBuilder.open(DefaultCacheRepository.java:118)
                                at org.gradle.groovy.scripts.internal.FileCacheBackedScriptClassCompiler.compile(FileCacheBackedScriptClassCompiler.java:105)
                                at org.gradle.groovy.scripts.internal.CrossBuildInMemoryCachingScriptClassCache.getOrCompile(CrossBuildInMemoryCachingScriptClassCache.java:49)
                                at org.gradle.groovy.scripts.internal.BuildScopeInMemoryCachingScriptClassCompiler.compile(BuildScopeInMemoryCachingScriptClassCompiler.java:50)
                                at org.gradle.groovy.scripts.DefaultScriptCompilerFactory$ScriptCompilerImpl.compile(DefaultScriptCompilerFactory.java:50)
                                at org.gradle.configuration.DefaultScriptPluginFactory$ScriptPluginImpl.apply(DefaultScriptPluginFactory.java:211)
                                at org.gradle.configuration.BuildOperationScriptPlugin$1$1.run(BuildOperationScriptPlugin.java:69)
                                at org.gradle.internal.operations.DefaultBuildOperationExecutor$RunnableBuildOperationWorker.execute(DefaultBuildOperationExecutor.java:402)
                                at org.gradle.internal.operations.DefaultBuildOperationExecutor$RunnableBuildOperationWorker.execute(DefaultBuildOperationExecutor.java:394)
                                at org.gradle.internal.operations.DefaultBuildOperationExecutor$1.execute(DefaultBuildOperationExecutor.java:165)
                                at org.gradle.internal.operations.DefaultBuildOperationExecutor.execute(DefaultBuildOperationExecutor.java:250)
                                at org.gradle.internal.operations.DefaultBuildOperationExecutor.execute(DefaultBuildOperationExecutor.java:158)
                                at org.gradle.internal.operations.DefaultBuildOperationExecutor.run(DefaultBuildOperationExecutor.java:92)
                                at org.gradle.internal.operations.DelegatingBuildOperationExecutor.run(DelegatingBuildOperationExecutor.java:31)
                                at org.gradle.configuration.BuildOperationScriptPlugin$1.execute(BuildOperationScriptPlugin.java:66)
                                at org.gradle.configuration.BuildOperationScriptPlugin$1.execute(BuildOperationScriptPlugin.java:63)
                                at org.gradle.configuration.internal.DefaultUserCodeApplicationContext.apply(DefaultUserCodeApplicationContext.java:48)
                                at org.gradle.configuration.BuildOperationScriptPlugin.apply(BuildOperationScriptPlugin.java:63)
                                at org.gradle.api.internal.plugins.DefaultObjectConfigurationAction.applyScript(DefaultObjectConfigurationAction.java:109)
                                at org.gradle.api.internal.plugins.DefaultObjectConfigurationAction.access$000(DefaultObjectConfigurationAction.java:38)
                                at org.gradle.api.internal.plugins.DefaultObjectConfigurationAction$1.run(DefaultObjectConfigurationAction.java:68)
                                at org.gradle.api.internal.plugins.DefaultObjectConfigurationAction.execute(DefaultObjectConfigurationAction.java:143)
                                at org.gradle.api.internal.project.AbstractPluginAware.apply(AbstractPluginAware.java:40)
                                at org.gradle.kotlin.dsl.support.delegates.ProjectDelegate.apply(ProjectDelegate.kt:344)
                                at org.gradle.kotlin.dsl.PluginAwareExtensionsKt.apply(PluginAwareExtensions.kt:33)
                                at org.gradle.kotlin.dsl.PluginAwareExtensionsKt.apply$default(PluginAwareExtensions.kt:31)
                                at Build_gradle.processPluginGradleScripts(build.gradle.kts:277)
                                at Build_gradle.downloadAndProcessCoronaPlugins(build.gradle.kts:607)
                                at Build_gradle.downloadAndProcessCoronaPlugins$default(build.gradle.kts:550)
                                at Build_gradle.<init>(build.gradle.kts:179)
                                at Program.execute(Unknown Source)
                                at org.gradle.kotlin.dsl.execution.Interpreter$ProgramHost.eval(Interpreter.kt:506)
                                at org.gradle.kotlin.dsl.execution.Interpreter$ProgramHost.evaluateSecondStageOf(Interpreter.kt:422)
                                at Program.execute(Unknown Source)
                                at org.gradle.kotlin.dsl.execution.Interpreter$ProgramHost.eval(Interpreter.kt:506)
                                at org.gradle.kotlin.dsl.execution.Interpreter.eval(Interpreter.kt:206)
                                at org.gradle.kotlin.dsl.provider.StandardKotlinScriptEvaluator.evaluate(KotlinScriptEvaluator.kt:114)
                                at org.gradle.kotlin.dsl.provider.KotlinScriptPluginFactory$create$1.invoke(KotlinScriptPluginFactory.kt:51)
                                at org.gradle.kotlin.dsl.provider.KotlinScriptPluginFactory$create$1.invoke(KotlinScriptPluginFactory.kt:36)
                                at org.gradle.kotlin.dsl.provider.KotlinScriptPlugin.apply(KotlinScriptPlugin.kt:34)
                                at org.gradle.configuration.BuildOperationScriptPlugin$1$1.run(BuildOperationScriptPlugin.java:69)
                                at org.gradle.internal.operations.DefaultBuildOperationExecutor$RunnableBuildOperationWorker.execute(DefaultBuildOperationExecutor.java:402)
Nov 27 04:03:20.473             at org.gradle.internal.operations.DefaultBuildOperationExecutor$RunnableBuildOperationWorker.execute(DefaultBuildOperationExecutor.java:394)
                                at org.gradle.internal.operations.DefaultBuildOperationExecutor$1.execute(DefaultBuildOperationExecutor.java:165)
                                at org.gradle.internal.operations.DefaultBuildOperationExecutor.execute(DefaultBuildOperationExecutor.java:250)
                                at org.gradle.internal.operations.DefaultBuildOperationExecutor.execute(DefaultBuildOperationExecutor.java:158)
                                at org.gradle.internal.operations.DefaultBuildOperationExecutor.run(DefaultBuildOperationExecutor.java:92)
                                at org.gradle.internal.operations.DelegatingBuildOperationExecutor.run(DelegatingBuildOperationExecutor.java:31)
                                at org.gradle.configuration.BuildOperationScriptPlugin$1.execute(BuildOperationScriptPlugin.java:66)
                                at org.gradle.configuration.BuildOperationScriptPlugin$1.execute(BuildOperationScriptPlugin.java:63)
                                at org.gradle.configuration.internal.DefaultUserCodeApplicationContext.apply(DefaultUserCodeApplicationContext.java:48)
                                at org.gradle.configuration.BuildOperationScriptPlugin.apply(BuildOperationScriptPlugin.java:63)
                                at org.gradle.configuration.project.BuildScriptProcessor$1.run(BuildScriptProcessor.java:44)
                                at org.gradle.internal.Factories$1.create(Factories.java:25)
                                at org.gradle.api.internal.project.DefaultProjectStateRegistry$ProjectStateImpl.withMutableState(DefaultProjectStateRegistry.java:200)
                                at org.gradle.api.internal.project.DefaultProjectStateRegistry$ProjectStateImpl.withMutableState(DefaultProjectStateRegistry.java:186)
                                at org.gradle.configuration.project.BuildScriptProcessor.execute(BuildScriptProcessor.java:41)
                                at org.gradle.configuration.project.BuildScriptProcessor.execute(BuildScriptProcessor.java:26)
                                at org.gradle.configuration.project.ConfigureActionsProjectEvaluator.evaluate(ConfigureActionsProjectEvaluator.java:34)
                                at org.gradle.configuration.project.LifecycleProjectEvaluator$EvaluateProject$1.run(LifecycleProjectEvaluator.java:106)
                                at org.gradle.internal.Factories$1.create(Factories.java:25)
                                at org.gradle.internal.work.DefaultWorkerLeaseService.withLocks(DefaultWorkerLeaseService.java:183)
                                at org.gradle.internal.work.StopShieldingWorkerLeaseService.withLocks(StopShieldingWorkerLeaseService.java:40)
                                at org.gradle.api.internal.project.DefaultProjectStateRegistry$ProjectStateImpl.withProjectLock(DefaultProjectStateRegistry.java:226)
                                at org.gradle.api.internal.project.DefaultProjectStateRegistry$ProjectStateImpl.withMutableState(DefaultProjectStateRegistry.java:220)
                                at org.gradle.api.internal.project.DefaultProjectStateRegistry$ProjectStateImpl.withMutableState(DefaultProjectStateRegistry.java:186)
                                at org.gradle.configuration.project.LifecycleProjectEvaluator$EvaluateProject.run(LifecycleProjectEvaluator.java:95)
                                at org.gradle.internal.operations.DefaultBuildOperationExecutor$RunnableBuildOperationWorker.execute(DefaultBuildOperationExecutor.java:402)
                                at org.gradle.internal.operations.DefaultBuildOperationExecutor$RunnableBuildOperationWorker.execute(DefaultBuildOperationExecutor.java:394)
                                at org.gradle.internal.operations.DefaultBuildOperationExecutor$1.execute(DefaultBuildOperationExecutor.java:165)
Nov 27 04:03:20.474             at org.gradle.internal.operations.DefaultBuildOperationExecutor.execute(DefaultBuildOperationExecutor.java:250)
                                at org.gradle.internal.operations.DefaultBuildOperationExecutor.execute(DefaultBuildOperationExecutor.java:158)
                                at org.gradle.internal.operations.DefaultBuildOperationExecutor.run(DefaultBuildOperationExecutor.java:92)
                                at org.gradle.internal.operations.DelegatingBuildOperationExecutor.run(DelegatingBuildOperationExecutor.java:31)
                                at org.gradle.configuration.project.LifecycleProjectEvaluator.evaluate(LifecycleProjectEvaluator.java:67)
                                at org.gradle.api.internal.project.DefaultProject.evaluate(DefaultProject.java:695)
                                at org.gradle.api.internal.project.DefaultProject.evaluate(DefaultProject.java:143)
                                at org.gradle.execution.TaskPathProjectEvaluator.configure(TaskPathProjectEvaluator.java:35)
                                at org.gradle.execution.TaskPathProjectEvaluator.configureHierarchy(TaskPathProjectEvaluator.java:62)
                                at org.gradle.configuration.DefaultBuildConfigurer.configure(DefaultBuildConfigurer.java:41)
                                at org.gradle.initialization.DefaultGradleLauncher$ConfigureBuild.run(DefaultGradleLauncher.java:302)
                                at org.gradle.internal.operations.DefaultBuildOperationExecutor$RunnableBuildOperationWorker.execute(DefaultBuildOperationExecutor.java:402)
                                at org.gradle.internal.operations.DefaultBuildOperationExecutor$RunnableBuildOperationWorker.execute(DefaultBuildOperationExecutor.java:394)
                                at org.gradle.internal.operations.DefaultBuildOperationExecutor$1.execute(DefaultBuildOperationExecutor.java:165)
                                at org.gradle.internal.operations.DefaultBuildOperationExecutor.execute(DefaultBuildOperationExecutor.java:250)
                                at org.gradle.internal.operations.DefaultBuildOperationExecutor.execute(DefaultBuildOperationExecutor.java:158)
                                at org.gradle.internal.operations.DefaultBuildOperationExecutor.run(DefaultBuildOperationExecutor.java:92)
                                at org.gradle.internal.operations.DelegatingBuildOperationExecutor.run(DelegatingBuildOperationExecutor.java:31)
                                at org.gradle.initialization.DefaultGradleLauncher.configureBuild(DefaultGradleLauncher.java:210)
                                at org.gradle.initialization.DefaultGradleLauncher.doBuildStages(DefaultGradleLauncher.java:151)
                                at org.gradle.initialization.DefaultGradleLauncher.executeTasks(DefaultGradleLauncher.java:134)
                                at org.gradle.internal.invocation.GradleBuildController$1.execute(GradleBuildController.java:58)
                                at org.gradle.internal.invocation.GradleBuildController$1.execute(GradleBuildController.java:55)
                                at org.gradle.internal.invocation.GradleBuildController$3.create(GradleBuildController.java:82)
                                at org.gradle.internal.invocation.GradleBuildController$3.create(GradleBuildController.java:75)
                                at org.gradle.internal.work.DefaultWorkerLeaseService.withLocks(DefaultWorkerLeaseService.java:183)
                                at org.gradle.internal.work.StopShieldingWorkerLeaseService.withLocks(StopShieldingWorkerLeaseService.java:40)
                                at org.gradle.internal.invocation.GradleBuildController.doBuild(GradleBuildController.java:75)
                                at org.gradle.internal.invocation.GradleBuildController.run(GradleBuildController.java:55)
                                at org.gradle.tooling.internal.provider.ExecuteBuildActionRunner.run(ExecuteBuildActionRunner.java:31)
                                at org.gradle.launcher.exec.ChainingBuildActionRunner.run(ChainingBuildActionRunner.java:35)
                                at org.gradle.launcher.exec.BuildOutcomeReportingBuildActionRunner.run(BuildOutcomeReportingBuildActionRunner.java:58)
                                at org.gradle.tooling.internal.provider.ValidatingBuildActionRunner.run(ValidatingBuildActionRunner.java:32)
                                at org.gradle.launcher.exec.BuildCompletionNotifyingBuildActionRunner.run(BuildCompletionNotifyingBuildActionRunner.java:39)
                                at org.gradle.launcher.exec.RunAsBuildOperationBuildActionRunner$3.call(RunAsBuildOperationBuildActionRunner.java:51)
                                at org.gradle.launcher.exec.RunAsBuildOperationBuildActionRunner$3.call(RunAsBuildOperationBuildActionRunner.java:45)
                                at org.gradle.internal.operations.DefaultBuildOperationExecutor$CallableBuildOperationWorker.execute(DefaultBuildOperationExecutor.java:416)
                                at org.gradle.internal.operations.DefaultBuildOperationExecutor$CallableBuildOperationWorker.execute(DefaultBuildOperationExecutor.java:406)
                                at org.gradle.internal.operations.DefaultBuildOperationExecutor$1.execute(DefaultBuildOperationExecutor.java:165)
                                at org.gradle.internal.operations.DefaultBuildOperationExecutor.execute(DefaultBuildOperationExecutor.java:250)
                                at org.gradle.internal.operations.DefaultBuildOperationExecutor.execute(DefaultBuildOperationExecutor.java:158)
                                at org.gradle.internal.operations.DefaultBuildOperationExecutor.call(DefaultBuildOperationExecutor.java:102)
Nov 27 04:03:20.475             at org.gradle.internal.operations.DelegatingBuildOperationExecutor.call(DelegatingBuildOperationExecutor.java:36)
                                at org.gradle.launcher.exec.RunAsBuildOperationBuildActionRunner.run(RunAsBuildOperationBuildActionRunner.java:45)
                                at org.gradle.launcher.exec.InProcessBuildActionExecuter$1.transform(InProcessBuildActionExecuter.java:49)
                                at org.gradle.launcher.exec.InProcessBuildActionExecuter$1.transform(InProcessBuildActionExecuter.java:46)
                                at org.gradle.composite.internal.DefaultRootBuildState.run(DefaultRootBuildState.java:78)
                                at org.gradle.launcher.exec.InProcessBuildActionExecuter.execute(InProcessBuildActionExecuter.java:46)
                                at org.gradle.launcher.exec.InProcessBuildActionExecuter.execute(InProcessBuildActionExecuter.java:31)
                                at org.gradle.launcher.exec.BuildTreeScopeBuildActionExecuter.execute(BuildTreeScopeBuildActionExecuter.java:42)
                                at org.gradle.launcher.exec.BuildTreeScopeBuildActionExecuter.execute(BuildTreeScopeBuildActionExecuter.java:28)
                                at org.gradle.tooling.internal.provider.ContinuousBuildActionExecuter.execute(ContinuousBuildActionExecuter.java:78)
                                at org.gradle.tooling.internal.provider.ContinuousBuildActionExecuter.execute(ContinuousBuildActionExecuter.java:52)
                                at org.gradle.tooling.internal.provider.SubscribableBuildActionExecuter.execute(SubscribableBuildActionExecuter.java:59)
                                at org.gradle.tooling.internal.provider.SubscribableBuildActionExecuter.execute(SubscribableBuildActionExecuter.java:36)
                                at org.gradle.tooling.internal.provider.SessionScopeBuildActionExecuter.execute(SessionScopeBuildActionExecuter.java:68)
                                at org.gradle.tooling.internal.provider.SessionScopeBuildActionExecuter.execute(SessionScopeBuildActionExecuter.java:38)
                                at org.gradle.tooling.internal.provider.GradleThreadBuildActionExecuter.execute(GradleThreadBuildActionExecuter.java:37)
                                at org.gradle.tooling.internal.provider.GradleThreadBuildActionExecuter.execute(GradleThreadBuildActionExecuter.java:26)
                                at org.gradle.tooling.internal.provider.ParallelismConfigurationBuildActionExecuter.execute(ParallelismConfigurationBuildActionExecuter.java:43)
                                at org.gradle.tooling.internal.provider.ParallelismConfigurationBuildActionExecuter.execute(ParallelismConfigurationBuildActionExecuter.java:29)
                                at org.gradle.tooling.internal.provider.StartParamsValidatingActionExecuter.execute(StartParamsValidatingActionExecuter.java:60)
                                at org.gradle.tooling.internal.provider.StartParamsValidatingActionExecuter.execute(StartParamsValidatingActionExecuter.java:32)
                                at org.gradle.tooling.internal.provider.SessionFailureReportingActionExecuter.execute(SessionFailureReportingActionExecuter.java:55)
                                at org.gradle.tooling.internal.provider.SessionFailureReportingActionExecuter.execute(SessionFailureReportingActionExecuter.java:41)
                                at org.gradle.tooling.internal.provider.SetupLoggingActionExecuter.execute(SetupLoggingActionExecuter.java:48)
                                at org.gradle.tooling.internal.provider.SetupLoggingActionExecuter.execute(SetupLoggingActionExecuter.java:32)
Nov 27 04:03:20.475             at org.gradle.launcher.daemon.server.exec.ExecuteBuild.doBuild(ExecuteBuild.java:67)
                                at org.gradle.launcher.daemon.server.exec.BuildCommandOnly.execute(BuildCommandOnly.java:36)
                                at org.gradle.launcher.daemon.server.api.DaemonCommandExecution.proceed(DaemonCommandExecution.java:104)
                                at org.gradle.launcher.daemon.server.exec.WatchForDisconnection.execute(WatchForDisconnection.java:37)
                                at org.gradle.launcher.daemon.server.api.DaemonCommandExecution.proceed(DaemonCommandExecution.java:104)
                                at org.gradle.launcher.daemon.server.exec.ResetDeprecationLogger.execute(ResetDeprecationLogger.java:26)
                                at org.gradle.launcher.daemon.server.api.DaemonCommandExecution.proceed(DaemonCommandExecution.java:104)
                                at org.gradle.launcher.daemon.server.exec.RequestStopIfSingleUsedDaemon.execute(RequestStopIfSingleUsedDaemon.java:34)
                                at org.gradle.launcher.daemon.server.api.DaemonCommandExecution.proceed(DaemonCommandExecution.java:104)
                                at org.gradle.launcher.daemon.server.exec.ForwardClientInput$2.call(ForwardClientInput.java:74)
                                at org.gradle.launcher.daemon.server.exec.ForwardClientInput$2.call(ForwardClientInput.java:72)
                                at org.gradle.util.Swapper.swap(Swapper.java:38)
                                at org.gradle.launcher.daemon.server.exec.ForwardClientInput.execute(ForwardClientInput.java:72)
                                at org.gradle.launcher.daemon.server.api.DaemonCommandExecution.proceed(DaemonCommandExecution.java:104)
                                at org.gradle.launcher.daemon.server.exec.LogAndCheckHealth.execute(LogAndCheckHealth.java:50)
                                at org.gradle.launcher.daemon.server.api.DaemonCommandExecution.proceed(DaemonCommandExecution.java:104)
                                at org.gradle.launcher.daemon.server.exec.LogToClient.doBuild(LogToClient.java:62)
                                at org.gradle.launcher.daemon.server.exec.BuildCommandOnly.execute(BuildCommandOnly.java:36)
                                at org.gradle.launcher.daemon.server.api.DaemonCommandExecution.proceed(DaemonCommandExecution.java:104)
                                at org.gradle.launcher.daemon.server.exec.EstablishBuildEnvironment.doBuild(EstablishBuildEnvironment.java:81)
Nov 27 04:03:20.476             at org.gradle.launcher.daemon.server.exec.BuildCommandOnly.execute(BuildCommandOnly.java:36)
                                at org.gradle.launcher.daemon.server.api.DaemonCommandExecution.proceed(DaemonCommandExecution.java:104)
                                at org.gradle.launcher.daemon.server.exec.StartBuildOrRespondWithBusy$1.run(StartBuildOrRespondWithBusy.java:50)
                                at org.gradle.launcher.daemon.server.DaemonStateCoordinator$1.run(DaemonStateCoordinator.java:295)
                                at org.gradle.internal.concurrent.ExecutorPolicy$CatchAndRecordFailures.onExecute(ExecutorPolicy.java:63)
                                at org.gradle.internal.concurrent.ManagedExecutorImpl$1.run(ManagedExecutorImpl.java:46)
                                at java.base/java.util.concurrent.ThreadPoolExecutor.runWorker(ThreadPoolExecutor.java:1128)
                                at java.base/java.util.concurrent.ThreadPoolExecutor$Worker.run(ThreadPoolExecutor.java:628)
                                at org.gradle.internal.concurrent.ThreadFactoryImpl$ManagedThreadRunnable.run(ThreadFactoryImpl.java:55)
                                at java.base/java.lang.Thread.run(Thread.java:830)
                            
                            1 error
                    
                    
                    * Try:
Nov 27 04:03:20.476 Run with --stacktrace option to get the stack trace. Run with --info or --debug option to get more log output. Run with --scan to get full insights.
                    
                    * Get more help at https://help.gradle.org
                    
                    BUILD FAILED in 44s
Nov 27 04:03:21.174 Excluding specified files from build:
                       excluding: LaunchScreen.storyboardc
                       excluding: Icon.png
                       excluding: Icon-*dpi.png
                       excluding: Images.xcassets
                    Android build failed (256) after 49 seconds
Nov 27 04:03:21.487 ERROR: Build Failed: Failed to Build
                    
                    Error code: 256

Nov 27 04:03:21.487
 



[TOPIC: post.html]
#4

lukascoossa

[GLOBAL: userInfoPane.html]
lukascoossa
  • Observer

  • 7 posts
  • Corona SDK

Pastebin for the build settings:

 

https://pastebin.com/raw/vKLURHbQ



[TOPIC: post.html]
#5

Rob Miracle

[GLOBAL: userInfoPane.html]
Rob Miracle
  • Moderator

  • 26,393 posts
  • Enterprise

My first suggestion would be to downgrade your Java from 1.13 to 1.18. You certainly need to downgrade the JDK and you may need to downgrade the JRE as well.

 

Rob



[TOPIC: post.html]
#6

lukascoossa

[GLOBAL: userInfoPane.html]
lukascoossa
  • Observer

  • 7 posts
  • Corona SDK

After I downgrade the JDK, what's the next step? Is there anything else I need to do?

 

Has there been similar problems with appodeal before? Were they fixed, if so how?

 

What exactly is the source of the problem, can you explain?



[TOPIC: post.html]
#7

lukascoossa

[GLOBAL: userInfoPane.html]
lukascoossa
  • Observer

  • 7 posts
  • Corona SDK

Also, I have tried downgrading the JDK before, and it didn't work.

 

The application prompted me to install the newer version of the JDK because 1.8 was "too outdated"



[TOPIC: post.html]
#8

Rob Miracle

[GLOBAL: userInfoPane.html]
Rob Miracle
  • Moderator

  • 26,393 posts
  • Enterprise

The problem is that the Gradle build system used by Android/Android studio needs Java JDK 1.8. JDK 1.13 won't work. Corona doesn't tell you that a JDK is outdated. What application told you this.

 

If you're running a later daily build (recommend the latest), it should pick up plugins that work correctly as long as you have removed JDK 1.13 and have 1.8.

 

Rob



[TOPIC: post.html]
#9

lukascoossa

[GLOBAL: userInfoPane.html]
lukascoossa
  • Observer

  • 7 posts
  • Corona SDK

Sounds cool. Could you maybe link some instructions on installing JDK 1.8? I want to make sure that I do it properly.

 

Also, has this method been proven to work? Do you know for sure if installing the JDK 1.8 will fix my problem for sure?



[TOPIC: post.html]
#10

Rob Miracle

[GLOBAL: userInfoPane.html]
Rob Miracle
  • Moderator

  • 26,393 posts
  • Enterprise

Visit: https://www.oracle.com/technetwork/java/javase/downloads/jdk8-downloads-2133151.html

 

You want: jdk-8u231-windows-i586.exe for Windows

or jdk-8u231-macosx-x64.dmg for macOS

 

Download and run the installer. But before you do you may want to remove any previous versions of the JDK:
This Google search should help you with that: https://www.google.com/search?q=removing+java+jdk&rlz=1C5CHFA_enUS841US841&oq=removing+java+jdk&aqs=chrome..0j69i57j0l6.9720j1j7&sourceid=chrome&ie=UTF-8

 

The Android build system (version of Gradle we are using) does not work with Java JDK 1.13. 1.8 is the newest version that works. 

 

Now you may run into other issues after you do this, but this problem has to be solved first.

 

Rob




[topic_controls]
[/topic_controls]

Also tagged with one or more of these keywords: appodeal