Jump to content

[TOPIC: topicViewTemplate]
[GLOBAL: userSmallPhoto]
Photo

Unable to Build 64 Bit
Started by akhtarx5 Sep 29 2019 12:53 PM

19 replies to this topic

Best Answer akhtarx5 , 07 October 2019 - 12:42 PM

thanks so much for all you help

 

managed to get it going, wrong java installed or too many java iterations installed

[TOPIC CONTROLS]
[/TOPIC CONTROLS]
[modOptionsDropdown]
[/modOptionsDropdown]
[reputationFilter]
[TOPIC: post.html]
#1

akhtarx5

[GLOBAL: userInfoPane.html]
akhtarx5
  • Enthusiast

  • 86 posts
  • Corona SDK

Hi

 

im unable to build any of the 64 bit corona builds

 

i have tried all the latest version from 3531

 

currently trying the first 64 bit version of 3504

i am getting the following error on build.

-------------------------------------------------------------------------------------

 

21:48:24.353  Testing credentials for 'C:\Program Files (x86)\Corona Labs\Corona\Resources\debug.keystore':
21:48:25.763  Picked up JAVA_TOOL_OPTIONS: -Duser.language=en
21:48:25.763  jar signed.
21:48:25.763  
21:48:25.763  Warning:
21:48:25.763  The signer's certificate is self-signed.
21:48:25.763  
21:48:25.763  The timestamp will expire on 2028-01-18.
21:48:26.793  Using custom build id from app bundle: 00000 (AppSettings.lua)
21:48:26.793  
21:48:26.793  Using custom Build Id 00000
21:48:36.231  Picked up JAVA_TOOL_OPTIONS: -Duser.language=en
21:48:36.231  Exception in thread "DisconnectableInputStream source reader" org.gradle.api.UncheckedIOException:

java.io.IOException: The handle is invalid
21:48:36.231      at org.gradle.internal.UncheckedException.throwAsUncheckedException(UncheckedException.java:61)
21:48:36.231      at org.gradle.internal.UncheckedException.throwAsUncheckedException(UncheckedException.java:41)
21:48:36.231      at org.gradle.util.DisconnectableInputStream$1.run(DisconnectableInputStream.java:125)
21:48:36.231      at java.base/java.lang.Thread.run(Thread.java:830)
21:48:36.231  Caused by: java.io.IOException: The handle is invalid
21:48:36.231      at java.base/java.io.FileInputStream.readBytes(Native Method)
21:48:36.231      at java.base/java.io.FileInputStream.read(FileInputStream.java:273)
21:48:36.231      at java.base/java.io.BufferedInputStream.fill(BufferedInputStream.java:245)
21:48:36.231      at java.base/java.io.BufferedInputStream.read1(BufferedInputStream.java:285)
21:48:36.231      at java.base/java.io.BufferedInputStream.read(BufferedInputStream.java:344)
21:48:36.231      at org.gradle.util.DisconnectableInputStream$1.run(DisconnectableInputStream.java:96)
21:48:36.231      ... 1 more
21:48:36.231  
21:48:36.231  FAILURE: Build failed with an exception.
21:48:36.231  
21:48:36.231  * Where:
21:48:36.231  Build file 'C:\Users\Windows-7\AppData\Local\Temp\Corona Labs\CLtmpa03540\template\app\build.gradle.kts' line: 80
21:48:36.231  
21:48:36.231  * What went wrong:
21:48:36.231  class com.beust.klaxon.JsonArray cannot be cast to class com.beust.klaxon.JsonObject (com.beust.klaxon.JsonArray and

com.beust.klaxon.JsonObject are in unnamed module of loader org.gradle.internal.classloader.VisitableURLClassLoader @149b488e)
21:48:36.231  
21:48:36.231  * Try:
21:48:36.231  Run with --stacktrace option to get the stack trace. Run with --info or --debug option to get more log output. Run

with --scan to get full insights.
21:48:36.231  
21:48:36.231  * Get more help at https://help.gradle.org
21:48:36.231  
21:48:36.231  BUILD FAILED in 7s
21:48:36.361  Android build failed (1) after 10 seconds

 

-------------------------------------------------------------------------------------

 

i have also tried installing the various Java Files

 

i.e version 8 version 10, version 11 , version 12 version 13

 

please help , thankyou



[TOPIC: post.html]
#2

vlads

[GLOBAL: userInfoPane.html]
vlads
  • Contributor

  • 972 posts
  • Corona Staff

Hey! Thanks for the report. Could you post to our build.settings? This error sometimes happens when you have empty objects in it. Like android = {}

[TOPIC: post.html]
#3

akhtarx5

[GLOBAL: userInfoPane.html]
akhtarx5
  • Enthusiast

  • 86 posts
  • Corona SDK

i tried building with an empty build file and it worked to build succesfully 64 bit.

 

i then removed each section in the build file to find out where the fault lies.

 

it appears when i remove the below plugin v2 i can build succesfully

is there another way i can use the "plugin.notifications.v2" in the build file

 

 

plugins =
    {
        ["plugin.notifications.v2"] =
        {
            publisherId = "com.coronalabs"
        },
    },

 

 

 

My build file

-------------------------------------------------------------------

settings =
    {

    iphone =
    {
    plist =
        {
        UIPrerenderedIcon = true,
        UIStatusBarHidden = true,
        UIApplicationExitsOnSuspend = true,
        --CFBundleIconFile  = "Icon.png",
        CFBundleIconFiles =
            {
            "Icon.png" ,
            "Icon@2x.png" ,
            "Icon-72.png" ,
            "Icon-Small-50.png" ,
            "Icon-Small.png" ,
            "Icon-Small@2x.png" ,
            },
                UIAppFonts =
            {
            
            "GillSans-Book.ttf",
            

            },                 
        },
    },

    orientation =
        {
        default = "portrait",
        supported =
            {
            "portrait"  --"landscapeRight","landscapeLeft","portrait","portraitUpsideDown"
            },

        },



    androidPermissions =
        {
        
        --"android.permission.INTERNET"
        "android.permission.READ_PHONE_STATE"
        
        },


    android =
    {
        usesPermissions =
        {
            "android.permission.RECEIVE_BOOT_COMPLETED",
        },
    },


    android =
    {
        --useGoogleServicesJson = true,
    },    



    window =
    {
        titleText =
        {
            default = "Local Notifications",
        },
    },


    plugins =
    {
        ["plugin.notifications.v2"] =
        {
            publisherId = "com.coronalabs"
        },
    },




    }

        


 



[TOPIC: post.html]
#4

vlads

[GLOBAL: userInfoPane.html]
vlads
  • Contributor

  • 972 posts
  • Corona Staff

I think removing empty Android section (or uncomment entry in it) would fix your issue.
  • vlads likes this

[TOPIC: post.html]
#5

akhtarx5

[GLOBAL: userInfoPane.html]
akhtarx5
  • Enthusiast

  • 86 posts
  • Corona SDK

Do you mean remove the following in my Build.settings file

 

android =
    {
        --useGoogleServicesJson = true,
    },  

 

thankyou



[TOPIC: post.html]
#6

vlads

[GLOBAL: userInfoPane.html]
vlads
  • Contributor

  • 972 posts
  • Corona Staff

Yes

[TOPIC: post.html]
#7

akhtarx5

[GLOBAL: userInfoPane.html]
akhtarx5
  • Enthusiast

  • 86 posts
  • Corona SDK

ok tried that,

 

i also tried removing everything in the build file so it looks like this

 

my build.settings file

----------------------------------------------------------------------------------------

settings =
    {

    
    
    plugins =
    {
        ["plugin.notifications.v2"] =
        {
            publisherId = "com.coronalabs"
        },
    },


   




    }

      

 

the error i get is

-----------------------------------------------------------------------------------------------------

 

Testing credentials for 'C:\Program Files (x86)\Corona Labs\Corona\Resources\debug.keystore':
15:14:34.622  Picked up JAVA_TOOL_OPTIONS: -Duser.language=en
15:14:34.622  jar signed.
15:14:34.622  
15:14:34.622  Warning:
15:14:34.622  The signer's certificate is self-signed.
15:14:34.622  
15:14:34.622  The timestamp will expire on 2028-01-18.
15:14:37.725  Using custom build id from app bundle: 00000 (AppSettings.lua)
15:14:37.725  
15:14:37.725  Using custom Build Id 00000
15:14:56.404  @ver > NUL
15:14:56.404  Picked up JAVA_TOOL_OPTIONS: -Duser.language=en
15:14:56.404  Exception in thread "DisconnectableInputStream source reader" org.gradle.api.UncheckedIOException: java.io.IOException: Access is denied
15:14:56.404      at org.gradle.internal.UncheckedException.throwAsUncheckedException(UncheckedException.java:61)
15:14:56.404      at org.gradle.internal.UncheckedException.throwAsUncheckedException(UncheckedException.java:41)
15:14:56.404      at org.gradle.util.DisconnectableInputStream$1.run(DisconnectableInputStream.java:125)
15:14:56.404      at java.base/java.lang.Thread.run(Thread.java:830)
15:14:56.404  Caused by: java.io.IOException: Access is denied
15:14:56.404      at java.base/java.io.FileInputStream.readBytes(Native Method)
15:14:56.404      at java.base/java.io.FileInputStream.read(FileInputStream.java:273)
15:14:56.404      at java.base/java.io.BufferedInputStream.fill(BufferedInputStream.java:245)
15:14:56.404      at java.base/java.io.BufferedInputStream.read1(BufferedInputStream.java:285)
15:14:56.404      at java.base/java.io.BufferedInputStream.read(BufferedInputStream.java:344)
15:14:56.404      at org.gradle.util.DisconnectableInputStream$1.run(DisconnectableInputStream.java:96)
15:14:56.404      ... 1 more
15:14:56.404  ERROR: configuring 'shared.firebase.messaging_com.coronalabs' failed!
15:14:56.404  
15:14:56.404  FAILURE: Build failed with an exception.
15:14:56.404  
15:14:56.404  * Where:
15:14:56.404  Build file 'C:\Users\Windows-7\AppData\Local\Temp\Corona Labs\CLtmpa06932\template\app\build.gradle.kts' line: 277
15:14:56.404  
15:14:56.404  * What went wrong:
15:14:56.404  Could not open dsl remapped class cache for 21tjb5jf7wgv11saot1wddt1t (C:\Users\Windows-7\.gradle\caches\5.4.1\scripts-remapped\corona_1m8b3w1jwg016imf4fgf3xtdc\21tjb5jf7wgv11saot1wddt1t\dsldcd040730888da95d185715568c9cc57).
15:14:56.404  > Could not open dsl generic class cache for script 'C:\Users\Windows-7\AppData\Local\Temp\Corona Labs\CLtmpa06932\template\app\build\corona-plugins\shared.firebase.messaging_com.coronalabs\corona.gradle' (C:\Users\Windows-7\.gradle\caches\5.4.1\scripts\21tjb5jf7wgv11saot1wddt1t\dsl\dsldcd040730888da95d185715568c9cc57).
15:14:56.404     > Could not compile script 'C:\Users\Windows-7\AppData\Local\Temp\Corona Labs\CLtmpa06932\template\app\build\corona-plugins\shared.firebase.messaging_com.coronalabs\corona.gradle'.
15:14:56.404        > startup failed:
15:14:56.404          General error during semantic analysis: Unsupported class file major version 57
15:14:56.404          
15:14:56.404          java.lang.IllegalArgumentException: Unsupported class file major version 57
15:14:56.404              at groovyjarjarasm.asm.ClassReader.<init>(ClassReader.java:184)
15:14:56.404              at groovyjarjarasm.asm.ClassReader.<init>(ClassReader.java:166)
15:14:56.404              at groovyjarjarasm.asm.ClassReader.<init>(ClassReader.java:152)
15:14:56.404              at groovyjarjarasm.asm.ClassReader.<init>(ClassReader.java:273)
15:14:56.404              at org.codehaus.groovy.ast.decompiled.AsmDecompiler.parseClass(AsmDecompiler.java:81)
15:14:56.404              at org.codehaus.groovy.control.ClassNodeResolver.findDecompiled(ClassNodeResolver.java:254)
15:14:56.404              at org.codehaus.groovy.control.ClassNodeResolver.tryAsLoaderClassOrScript(ClassNodeResolver.java:192)
15:14:56.404              at org.codehaus.groovy.control.ClassNodeResolver.findClassNode(ClassNodeResolver.java:172)
15:14:56.404              at org.codehaus.groovy.control.ClassNodeResolver.resolveName(ClassNodeResolver.java:128)
15:14:56.404              at org.codehaus.groovy.ast.decompiled.AsmReferenceResolver.resolveClassNullable(AsmReferenceResolver.java:59)
15:14:56.404              at org.codehaus.groovy.ast.decompiled.AsmReferenceResolver.resolveClass(AsmReferenceResolver.java:46)
15:14:56.404              at org.codehaus.groovy.ast.decompiled.AsmReferenceResolver.resolveNonArrayType(AsmReferenceResolver.java:81)
15:14:56.404              at org.codehaus.groovy.ast.decompiled.AsmReferenceResolver.resolveType(AsmReferenceResolver.java:72)
15:14:56.404              at org.codehaus.groovy.ast.decompiled.MemberSignatureParser.createMethodNode(MemberSignatureParser.java:55)
15:14:56.404              at org.codehaus.groovy.ast.decompiled.DecompiledClassNode.lazyInitMembers(DecompiledClassNode.java:195)
15:14:56.404              at org.codehaus.groovy.ast.decompiled.DecompiledClassNode.getDeclaredMethods(DecompiledClassNode.java:121)
15:14:56.404              at org.codehaus.groovy.ast.ClassNode.getMethods(ClassNode.java:912)
15:14:56.404              at org.codehaus.groovy.ast.ClassNode.tryFindPossibleMethod(ClassNode.java:1280)
15:14:56.404              at org.codehaus.groovy.control.StaticImportVisitor.transformMethodCallExpression(StaticImportVisitor.java:252)
15:14:56.404              at org.codehaus.groovy.control.StaticImportVisitor.transform(StaticImportVisitor.java:112)
15:14:56.404              at org.codehaus.groovy.ast.ClassCodeExpressionTransformer.visitExpressionStatement(ClassCodeExpressionTransformer.java:144)
15:14:56.404              at org.codehaus.groovy.ast.stmt.ExpressionStatement.visit(ExpressionStatement.java:42)
15:14:56.404              at org.codehaus.groovy.ast.ClassCodeVisitorSupport.visitClassCodeContainer(ClassCodeVisitorSupport.java:110)
15:14:56.404              at org.codehaus.groovy.ast.ClassCodeVisitorSupport.visitConstructorOrMethod(ClassCodeVisitorSupport.java:121)
15:14:56.404              at org.codehaus.groovy.ast.ClassCodeExpressionTransformer.visitConstructorOrMethod(ClassCodeExpressionTransformer.java:55)
15:14:56.404              at org.codehaus.groovy.control.StaticImportVisitor.visitConstructorOrMethod(StaticImportVisitor.java:88)
15:14:56.404              at org.codehaus.groovy.ast.ClassCodeVisitorSupport.visitConstructor(ClassCodeVisitorSupport.java:128)
15:14:56.404              at org.codehaus.groovy.ast.ClassNode.visitContents(ClassNode.java:1099)
15:14:56.404              at org.codehaus.groovy.ast.ClassCodeVisitorSupport.visitClass(ClassCodeVisitorSupport.java:54)
15:14:56.404              at org.codehaus.groovy.control.StaticImportVisitor.visitClass(StaticImportVisitor.java:82)
15:14:56.404              at org.codehaus.groovy.control.CompilationUnit$14.call(CompilationUnit.java:717)
15:14:56.404              at org.codehaus.groovy.control.CompilationUnit.applyToPrimaryClassNodes(CompilationUnit.java:1095)
15:14:56.404              at org.codehaus.groovy.control.CompilationUnit.doPhaseOperation(CompilationUnit.java:649)
15:14:56.404              at org.codehaus.groovy.control.CompilationUnit.processPhaseOperations(CompilationUnit.java:627)
15:14:56.404              at org.codehaus.groovy.control.CompilationUnit.compile(CompilationUnit.java:604)
15:14:56.404              at groovy.lang.GroovyClassLoader.doParseClass(GroovyClassLoader.java:390)
15:14:56.404              at groovy.lang.GroovyClassLoader.access$300(GroovyClassLoader.java:89)
15:14:56.404              at groovy.lang.GroovyClassLoader$5.provide(GroovyClassLoader.java:330)
15:14:56.404              at groovy.lang.GroovyClassLoader$5.provide(GroovyClassLoader.java:327)
15:14:56.404              at org.codehaus.groovy.runtime.memoize.ConcurrentCommonCache.getAndPut(ConcurrentCommonCache.java:147)
15:14:56.404              at groovy.lang.GroovyClassLoader.parseClass(GroovyClassLoader.java:325)
15:14:56.404              at org.gradle.groovy.scripts.internal.DefaultScriptCompilationHandler.compileScript(DefaultScriptCompilationHandler.java:133)
15:14:56.404              at org.gradle.groovy.scripts.internal.DefaultScriptCompilationHandler.compileToDir(DefaultScriptCompilationHandler.java:93)
15:14:56.404              at org.gradle.groovy.scripts.internal.BuildOperationBackedScriptCompilationHandler$2.run(BuildOperationBackedScriptCompilationHandler.java:54)
15:14:56.404              at org.gradle.internal.operations.DefaultBuildOperationExecutor$RunnableBuildOperationWorker.execute(DefaultBuildOperationExecutor.java:402)
15:14:56.404              at org.gradle.internal.operations.DefaultBuildOperationExecutor$RunnableBuildOperationWorker.execute(DefaultBuildOperationExecutor.java:394)
15:14:56.404              at org.gradle.internal.operations.DefaultBuildOperationExecutor$1.execute(DefaultBuildOperationExecutor.java:165)
15:14:56.404              at org.gradle.internal.operations.DefaultBuildOperationExecutor.execute(DefaultBuildOperationExecutor.java:250)
15:14:56.404              at org.gradle.internal.operations.DefaultBuildOperationExecutor.execute(DefaultBuildOperationExecutor.java:158)
15:14:56.404              at org.gradle.internal.operations.DefaultBuildOperationExecutor.run(DefaultBuildOperationExecutor.java:92)
15:14:56.404              at org.gradle.internal.operations.DelegatingBuildOperationExecutor.run(DelegatingBuildOperationExecutor.java:31)
15:14:56.404              at org.gradle.groovy.scripts.internal.BuildOperationBackedScriptCompilationHandler.compileToDir(BuildOperationBackedScriptCompilationHandler.java:51)
15:14:56.404              at org.gradle.groovy.scripts.internal.FileCacheBackedScriptClassCompiler$CompileToCrossBuildCacheAction.execute(FileCacheBackedScriptClassCompiler.java:151)
15:14:56.404              at org.gradle.groovy.scripts.internal.FileCacheBackedScriptClassCompiler$CompileToCrossBuildCacheAction.execute(FileCacheBackedScriptClassCompiler.java:132)
15:14:56.404              at org.gradle.groovy.scripts.internal.FileCacheBackedScriptClassCompiler$ProgressReportingInitializer.execute(FileCacheBackedScriptClassCompiler.java:175)
15:14:56.404              at org.gradle.groovy.scripts.internal.FileCacheBackedScriptClassCompiler$ProgressReportingInitializer.execute(FileCacheBackedScriptClassCompiler.java:155)
15:14:56.404              at org.gradle.cache.internal.DefaultPersistentDirectoryCache$Initializer.initialize(DefaultPersistentDirectoryCache.java:98)
15:14:56.404              at org.gradle.cache.internal.FixedSharedModeCrossProcessCacheAccess$1.run(FixedSharedModeCrossProcessCacheAccess.java:85)
15:14:56.404              at org.gradle.cache.internal.DefaultFileLockManager$DefaultFileLock.doWriteAction(DefaultFileLockManager.java:207)
15:14:56.404              at org.gradle.cache.internal.DefaultFileLockManager$DefaultFileLock.writeFile(DefaultFileLockManager.java:197)
15:14:56.404              at org.gradle.cache.internal.FixedSharedModeCrossProcessCacheAccess.open(FixedSharedModeCrossProcessCacheAccess.java:83)
15:14:56.404              at org.gradle.cache.internal.DefaultCacheAccess.open(DefaultCacheAccess.java:142)
15:14:56.404              at org.gradle.cache.internal.DefaultPersistentDirectoryStore.open(DefaultPersistentDirectoryStore.java:78)
15:14:56.404              at org.gradle.cache.internal.DefaultPersistentDirectoryStore.open(DefaultPersistentDirectoryStore.java:42)
15:14:56.404              at org.gradle.cache.internal.DefaultCacheFactory.doOpen(DefaultCacheFactory.java:94)
15:14:56.404              at org.gradle.cache.internal.DefaultCacheFactory.open(DefaultCacheFactory.java:68)
15:14:56.404              at org.gradle.cache.internal.DefaultCacheRepository$PersistentCacheBuilder.open(DefaultCacheRepository.java:118)
15:14:56.404              at org.gradle.groovy.scripts.internal.FileCacheBackedScriptClassCompiler$RemapBuildScriptsAction.execute(FileCacheBackedScriptClassCompiler.java:421)
15:14:56.404              at org.gradle.groovy.scripts.internal.FileCacheBackedScriptClassCompiler$RemapBuildScriptsAction.execute(FileCacheBackedScriptClassCompiler.java:390)
15:14:56.404              at org.gradle.groovy.scripts.internal.FileCacheBackedScriptClassCompiler$ProgressReportingInitializer.execute(FileCacheBackedScriptClassCompiler.java:175)
15:14:56.404              at org.gradle.groovy.scripts.internal.FileCacheBackedScriptClassCompiler$ProgressReportingInitializer.execute(FileCacheBackedScriptClassCompiler.java:155)
15:14:56.404              at org.gradle.cache.internal.DefaultPersistentDirectoryCache$Initializer.initialize(DefaultPersistentDirectoryCache.java:98)
15:14:56.404              at org.gradle.cache.internal.FixedSharedModeCrossProcessCacheAccess$1.run(FixedSharedModeCrossProcessCacheAccess.java:85)
15:14:56.404              at org.gradle.cache.internal.DefaultFileLockManager$DefaultFileLock.doWriteAction(DefaultFileLockManager.java:207)
15:14:56.404              at org.gradle.cache.internal.DefaultFileLockManager$DefaultFileLock.writeFile(DefaultFileLockManager.java:197)
15:14:56.404              at org.gradle.cache.internal.FixedSharedModeCrossProcessCacheAccess.open(FixedSharedModeCrossProcessCacheAccess.java:83)
15:14:56.404              at org.gradle.cache.internal.DefaultCacheAccess.open(DefaultCacheAccess.java:142)
15:14:56.404              at org.gradle.cache.internal.DefaultPersistentDirectoryStore.open(DefaultPersistentDirectoryStore.java:78)
15:14:56.404              at org.gradle.cache.internal.DefaultPersistentDirectoryStore.open(DefaultPersistentDirectoryStore.java:42)
15:14:56.404              at org.gradle.cache.internal.DefaultCacheFactory.doOpen(DefaultCacheFactory.java:94)
15:14:56.404              at org.gradle.cache.internal.DefaultCacheFactory.open(DefaultCacheFactory.java:68)
15:14:56.404              at org.gradle.cache.internal.DefaultCacheRepository$PersistentCacheBuilder.open(DefaultCacheRepository.java:118)
15:14:56.404              at org.gradle.groovy.scripts.internal.FileCacheBackedScriptClassCompiler.compile(FileCacheBackedScriptClassCompiler.java:105)
15:14:56.404              at org.gradle.groovy.scripts.internal.CrossBuildInMemoryCachingScriptClassCache.getOrCompile(CrossBuildInMemoryCachingScriptClassCache.java:49)
15:14:56.404              at org.gradle.groovy.scripts.internal.BuildScopeInMemoryCachingScriptClassCompiler.compile(BuildScopeInMemoryCachingScriptClassCompiler.java:50)
15:14:56.404              at org.gradle.groovy.scripts.DefaultScriptCompilerFactory$ScriptCompilerImpl.compile(DefaultScriptCompilerFactory.java:50)
15:14:56.404              at org.gradle.configuration.DefaultScriptPluginFactory$ScriptPluginImpl.apply(DefaultScriptPluginFactory.java:211)
15:14:56.404              at org.gradle.configuration.BuildOperationScriptPlugin$1$1.run(BuildOperationScriptPlugin.java:69)
15:14:56.404              at org.gradle.internal.operations.DefaultBuildOperationExecutor$RunnableBuildOperationWorker.execute(DefaultBuildOperationExecutor.java:402)
15:14:56.404              at org.gradle.internal.operations.DefaultBuildOperationExecutor$RunnableBuildOperationWorker.execute(DefaultBuildOperationExecutor.java:394)
15:14:56.404              at org.gradle.internal.operations.DefaultBuildOperationExecutor$1.execute(DefaultBuildOperationExecutor.java:165)
15:14:56.404              at org.gradle.internal.operations.DefaultBuildOperationExecutor.execute(DefaultBuildOperationExecutor.java:250)
15:14:56.404              at org.gradle.internal.operations.DefaultBuildOperationExecutor.execute(DefaultBuildOperationExecutor.java:158)
15:14:56.404              at org.gradle.internal.operations.DefaultBuildOperationExecutor.run(DefaultBuildOperationExecutor.java:92)
15:14:56.404              at org.gradle.internal.operations.DelegatingBuildOperationExecutor.run(DelegatingBuildOperationExecutor.java:31)
15:14:56.404              at org.gradle.configuration.BuildOperationScriptPlugin$1.execute(BuildOperationScriptPlugin.java:66)
15:14:56.404              at org.gradle.configuration.BuildOperationScriptPlugin$1.execute(BuildOperationScriptPlugin.java:63)
15:14:56.404              at org.gradle.configuration.internal.DefaultUserCodeApplicationContext.apply(DefaultUserCodeApplicationContext.java:48)
15:14:56.404              at org.gradle.configuration.BuildOperationScriptPlugin.apply(BuildOperationScriptPlugin.java:63)
15:14:56.404              at org.gradle.api.internal.plugins.DefaultObjectConfigurationAction.applyScript(DefaultObjectConfigurationAction.java:109)
15:14:56.404              at org.gradle.api.internal.plugins.DefaultObjectConfigurationAction.access$000(DefaultObjectConfigurationAction.java:38)
15:14:56.404              at org.gradle.api.internal.plugins.DefaultObjectConfigurationAction$1.run(DefaultObjectConfigurationAction.java:68)
15:14:56.404              at org.gradle.api.internal.plugins.DefaultObjectConfigurationAction.execute(DefaultObjectConfigurationAction.java:143)
15:14:56.404              at org.gradle.api.internal.project.AbstractPluginAware.apply(AbstractPluginAware.java:40)
15:14:56.404              at org.gradle.kotlin.dsl.support.delegates.ProjectDelegate.apply(ProjectDelegate.kt:344)
15:14:56.404              at org.gradle.kotlin.dsl.PluginAwareExtensionsKt.apply(PluginAwareExtensions.kt:33)
15:14:56.404              at org.gradle.kotlin.dsl.PluginAwareExtensionsKt.apply$default(PluginAwareExtensions.kt:31)
15:14:56.404              at Build_gradle.processPluginGradleScripts(build.gradle.kts:277)
15:14:56.404              at Build_gradle.downloadAndProcessCoronaPlugins(build.gradle.kts:607)
15:14:56.404              at Build_gradle.downloadAndProcessCoronaPlugins$default(build.gradle.kts:550)
15:14:56.404              at Build_gradle.<init>(build.gradle.kts:179)
15:14:56.404              at Program.execute(Unknown Source)
15:14:56.404              at org.gradle.kotlin.dsl.execution.Interpreter$ProgramHost.eval(Interpreter.kt:506)
15:14:56.404              at org.gradle.kotlin.dsl.execution.Interpreter$ProgramHost.evaluateSecondStageOf(Interpreter.kt:422)
15:14:56.404              at Program.execute(Unknown Source)
15:14:56.404              at org.gradle.kotlin.dsl.execution.Interpreter$ProgramHost.eval(Interpreter.kt:506)
15:14:56.404              at org.gradle.kotlin.dsl.execution.Interpreter.eval(Interpreter.kt:206)
15:14:56.404              at org.gradle.kotlin.dsl.provider.StandardKotlinScriptEvaluator.evaluate(KotlinScriptEvaluator.kt:114)
15:14:56.404              at org.gradle.kotlin.dsl.provider.KotlinScriptPluginFactory$create$1.invoke(KotlinScriptPluginFactory.kt:51)
15:14:56.404              at org.gradle.kotlin.dsl.provider.KotlinScriptPluginFactory$create$1.invoke(KotlinScriptPluginFactory.kt:36)
15:14:56.404              at org.gradle.kotlin.dsl.provider.KotlinScriptPlugin.apply(KotlinScriptPlugin.kt:34)
15:14:56.404              at org.gradle.configuration.BuildOperationScriptPlugin$1$1.run(BuildOperationScriptPlugin.java:69)
15:14:56.404              at org.gradle.internal.operations.DefaultBuildOperationExecutor$RunnableBuildOperationWorker.execute(DefaultBuildOperationExecutor.java:402)
15:14:56.404              at org.gradle.internal.operations.DefaultBuildOperationExecutor$RunnableBuildOperationWorker.execute(DefaultBuildOperationExecutor.java:394)
15:14:56.404              at org.gradle.internal.operations.DefaultBuildOperationExecutor$1.execute(DefaultBuildOperationExecutor.java:165)
15:14:56.404              at org.gradle.internal.operations.DefaultBuildOperationExecutor.execute(DefaultBuildOperationExecutor.java:250)
15:14:56.404              at org.gradle.internal.operations.DefaultBuildOperationExecutor.execute(DefaultBuildOperationExecutor.java:158)
15:14:56.404              at org.gradle.internal.operations.DefaultBuildOperationExecutor.run(DefaultBuildOperationExecutor.java:92)
15:14:56.404              at org.gradle.internal.operations.DelegatingBuildOperationExecutor.run(DelegatingBuildOperationExecutor.java:31)
15:14:56.404              at org.gradle.configuration.BuildOperationScriptPlugin$1.execute(BuildOperationScriptPlugin.java:66)
15:14:56.404              at org.gradle.configuration.BuildOperationScriptPlugin$1.execute(BuildOperationScriptPlugin.java:63)
15:14:56.404              at org.gradle.configuration.internal.DefaultUserCodeApplicationContext.apply(DefaultUserCodeApplicationContext.java:48)
15:14:56.404              at org.gradle.configuration.BuildOperationScriptPlugin.apply(BuildOperationScriptPlugin.java:63)
15:14:56.404              at org.gradle.configuration.project.BuildScriptProcessor$1.run(BuildScriptProcessor.java:44)
15:14:56.404              at org.gradle.internal.Factories$1.create(Factories.java:25)
15:14:56.404              at org.gradle.api.internal.project.DefaultProjectStateRegistry$ProjectStateImpl.withMutableState(DefaultProjectStateRegistry.java:200)
15:14:56.404              at org.gradle.api.internal.project.DefaultProjectStateRegistry$ProjectStateImpl.withMutableState(DefaultProjectStateRegistry.java:186)
15:14:56.404              at org.gradle.configuration.project.BuildScriptProcessor.execute(BuildScriptProcessor.java:41)
15:14:56.404              at org.gradle.configuration.project.BuildScriptProcessor.execute(BuildScriptProcessor.java:26)
15:14:56.404              at org.gradle.configuration.project.ConfigureActionsProjectEvaluator.evaluate(ConfigureActionsProjectEvaluator.java:34)
15:14:56.404              at org.gradle.configuration.project.LifecycleProjectEvaluator$EvaluateProject$1.run(LifecycleProjectEvaluator.java:106)
15:14:56.404              at org.gradle.internal.Factories$1.create(Factories.java:25)
15:14:56.404              at org.gradle.internal.work.DefaultWorkerLeaseService.withLocks(DefaultWorkerLeaseService.java:183)
15:14:56.404              at org.gradle.internal.work.StopShieldingWorkerLeaseService.withLocks(StopShieldingWorkerLeaseService.java:40)
15:14:56.404              at org.gradle.api.internal.project.DefaultProjectStateRegistry$ProjectStateImpl.withProjectLock(DefaultProjectStateRegistry.java:226)
15:14:56.404              at org.gradle.api.internal.project.DefaultProjectStateRegistry$ProjectStateImpl.withMutableState(DefaultProjectStateRegistry.java:220)
15:14:56.404              at org.gradle.api.internal.project.DefaultProjectStateRegistry$ProjectStateImpl.withMutableState(DefaultProjectStateRegistry.java:186)
15:14:56.404              at org.gradle.configuration.project.LifecycleProjectEvaluator$EvaluateProject.run(LifecycleProjectEvaluator.java:95)
15:14:56.404              at org.gradle.internal.operations.DefaultBuildOperationExecutor$RunnableBuildOperationWorker.execute(DefaultBuildOperationExecutor.java:402)
15:14:56.404              at org.gradle.internal.operations.DefaultBuildOperationExecutor$RunnableBuildOperationWorker.execute(DefaultBuildOperationExecutor.java:394)
15:14:56.404              at org.gradle.internal.operations.DefaultBuildOperationExecutor$1.execute(DefaultBuildOperationExecutor.java:165)
15:14:56.404              at org.gradle.internal.operations.DefaultBuildOperationExecutor.execute(DefaultBuildOperationExecutor.java:250)
15:14:56.404              at org.gradle.internal.operations.DefaultBuildOperationExecutor.execute(DefaultBuildOperationExecutor.java:158)
15:14:56.404              at org.gradle.internal.operations.DefaultBuildOperationExecutor.run(DefaultBuildOperationExecutor.java:92)
15:14:56.404              at org.gradle.internal.operations.DelegatingBuildOperationExecutor.run(DelegatingBuildOperationExecutor.java:31)
15:14:56.404              at org.gradle.configuration.project.LifecycleProjectEvaluator.evaluate(LifecycleProjectEvaluator.java:67)
15:14:56.404              at org.gradle.api.internal.project.DefaultProject.evaluate(DefaultProject.java:695)
15:14:56.404              at org.gradle.api.internal.project.DefaultProject.evaluate(DefaultProject.java:143)
15:14:56.404              at org.gradle.execution.TaskPathProjectEvaluator.configure(TaskPathProjectEvaluator.java:35)
15:14:56.404              at org.gradle.execution.TaskPathProjectEvaluator.configureHierarchy(TaskPathProjectEvaluator.java:62)
15:14:56.404              at org.gradle.configuration.DefaultBuildConfigurer.configure(DefaultBuildConfigurer.java:41)
15:14:56.404              at org.gradle.initialization.DefaultGradleLauncher$ConfigureBuild.run(DefaultGradleLauncher.java:302)
15:14:56.404              at org.gradle.internal.operations.DefaultBuildOperationExecutor$RunnableBuildOperationWorker.execute(DefaultBuildOperationExecutor.java:402)
15:14:56.404              at org.gradle.internal.operations.DefaultBuildOperationExecutor$RunnableBuildOperationWorker.execute(DefaultBuildOperationExecutor.java:394)
15:14:56.404              at org.gradle.internal.operations.DefaultBuildOperationExecutor$1.execute(DefaultBuildOperationExecutor.java:165)
15:14:56.404              at org.gradle.internal.operations.DefaultBuildOperationExecutor.execute(DefaultBuildOperationExecutor.java:250)
15:14:56.404              at org.gradle.internal.operations.DefaultBuildOperationExecutor.execute(DefaultBuildOperationExecutor.java:158)
15:14:56.404              at org.gradle.internal.operations.DefaultBuildOperationExecutor.run(DefaultBuildOperationExecutor.java:92)
15:14:56.404              at org.gradle.internal.operations.DelegatingBuildOperationExecutor.run(DelegatingBuildOperationExecutor.java:31)
15:14:56.404              at org.gradle.initialization.DefaultGradleLauncher.configureBuild(DefaultGradleLauncher.java:210)
15:14:56.404              at org.gradle.initialization.DefaultGradleLauncher.doBuildStages(DefaultGradleLauncher.java:151)
15:14:56.404              at org.gradle.initialization.DefaultGradleLauncher.executeTasks(DefaultGradleLauncher.java:134)
15:14:56.404              at org.gradle.internal.invocation.GradleBuildController$1.execute(GradleBuildController.java:58)
15:14:56.404              at org.gradle.internal.invocation.GradleBuildController$1.execute(GradleBuildController.java:55)
15:14:56.404              at org.gradle.internal.invocation.GradleBuildController$3.create(GradleBuildController.java:82)
15:14:56.404              at org.gradle.internal.invocation.GradleBuildController$3.create(GradleBuildController.java:75)
15:14:56.404              at org.gradle.internal.work.DefaultWorkerLeaseService.withLocks(DefaultWorkerLeaseService.java:183)
15:14:56.404              at org.gradle.internal.work.StopShieldingWorkerLeaseService.withLocks(StopShieldingWorkerLeaseService.java:40)
15:14:56.404              at org.gradle.internal.invocation.GradleBuildController.doBuild(GradleBuildController.java:75)
15:14:56.404              at org.gradle.internal.invocation.GradleBuildController.run(GradleBuildController.java:55)
15:14:56.404              at org.gradle.tooling.internal.provider.ExecuteBuildActionRunner.run(ExecuteBuildActionRunner.java:31)
15:14:56.404              at org.gradle.launcher.exec.ChainingBuildActionRunner.run(ChainingBuildActionRunner.java:35)
15:14:56.404              at org.gradle.launcher.exec.BuildOutcomeReportingBuildActionRunner.run(BuildOutcomeReportingBuildActionRunner.java:58)
15:14:56.404              at org.gradle.tooling.internal.provider.ValidatingBuildActionRunner.run(ValidatingBuildActionRunner.java:32)
15:14:56.404              at org.gradle.launcher.exec.BuildCompletionNotifyingBuildActionRunner.run(BuildCompletionNotifyingBuildActionRunner.java:39)
15:14:56.404              at org.gradle.launcher.exec.RunAsBuildOperationBuildActionRunner$3.call(RunAsBuildOperationBuildActionRunner.java:51)
15:14:56.404              at org.gradle.launcher.exec.RunAsBuildOperationBuildActionRunner$3.call(RunAsBuildOperationBuildActionRunner.java:45)
15:14:56.404              at org.gradle.internal.operations.DefaultBuildOperationExecutor$CallableBuildOperationWorker.execute(DefaultBuildOperationExecutor.java:416)
15:14:56.404              at org.gradle.internal.operations.DefaultBuildOperationExecutor$CallableBuildOperationWorker.execute(DefaultBuildOperationExecutor.java:406)
15:14:56.404              at org.gradle.internal.operations.DefaultBuildOperationExecutor$1.execute(DefaultBuildOperationExecutor.java:165)
15:14:56.404              at org.gradle.internal.operations.DefaultBuildOperationExecutor.execute(DefaultBuildOperationExecutor.java:250)
15:14:56.404              at org.gradle.internal.operations.DefaultBuildOperationExecutor.execute(DefaultBuildOperationExecutor.java:158)
15:14:56.404              at org.gradle.internal.operations.DefaultBuildOperationExecutor.call(DefaultBuildOperationExecutor.java:102)
15:14:56.404              at org.gradle.internal.operations.DelegatingBuildOperationExecutor.call(DelegatingBuildOperationExecutor.java:36)
15:14:56.404              at org.gradle.launcher.exec.RunAsBuildOperationBuildActionRunner.run(RunAsBuildOperationBuildActionRunner.java:45)
15:14:56.404              at org.gradle.launcher.exec.InProcessBuildActionExecuter$1.transform(InProcessBuildActionExecuter.java:49)
15:14:56.404              at org.gradle.launcher.exec.InProcessBuildActionExecuter$1.transform(InProcessBuildActionExecuter.java:46)
15:14:56.404              at org.gradle.composite.internal.DefaultRootBuildState.run(DefaultRootBuildState.java:78)
15:14:56.404              at org.gradle.launcher.exec.InProcessBuildActionExecuter.execute(InProcessBuildActionExecuter.java:46)
15:14:56.404              at org.gradle.launcher.exec.InProcessBuildActionExecuter.execute(InProcessBuildActionExecuter.java:31)
15:14:56.404              at org.gradle.launcher.exec.BuildTreeScopeBuildActionExecuter.execute(BuildTreeScopeBuildActionExecuter.java:42)
15:14:56.404              at org.gradle.launcher.exec.BuildTreeScopeBuildActionExecuter.execute(BuildTreeScopeBuildActionExecuter.java:28)
15:14:56.404              at org.gradle.tooling.internal.provider.ContinuousBuildActionExecuter.execute(ContinuousBuildActionExecuter.java:78)
15:14:56.404              at org.gradle.tooling.internal.provider.ContinuousBuildActionExecuter.execute(ContinuousBuildActionExecuter.java:52)
15:14:56.404              at org.gradle.tooling.internal.provider.SubscribableBuildActionExecuter.execute(SubscribableBuildActionExecuter.java:59)
15:14:56.404              at org.gradle.tooling.internal.provider.SubscribableBuildActionExecuter.execute(SubscribableBuildActionExecuter.java:36)
15:14:56.404              at org.gradle.tooling.internal.provider.SessionScopeBuildActionExecuter.execute(SessionScopeBuildActionExecuter.java:68)
15:14:56.404              at org.gradle.tooling.internal.provider.SessionScopeBuildActionExecuter.execute(SessionScopeBuildActionExecuter.java:38)
15:14:56.404              at org.gradle.tooling.internal.provider.GradleThreadBuildActionExecuter.execute(GradleThreadBuildActionExecuter.java:37)
15:14:56.404              at org.gradle.tooling.internal.provider.GradleThreadBuildActionExecuter.execute(GradleThreadBuildActionExecuter.java:26)
15:14:56.404              at org.gradle.tooling.internal.provider.ParallelismConfigurationBuildActionExecuter.execute(ParallelismConfigurationBuildActionExecuter.java:43)
15:14:56.404              at org.gradle.tooling.internal.provider.ParallelismConfigurationBuildActionExecuter.execute(ParallelismConfigurationBuildActionExecuter.java:29)
15:14:56.404              at org.gradle.tooling.internal.provider.StartParamsValidatingActionExecuter.execute(StartParamsValidatingActionExecuter.java:60)
15:14:56.404              at org.gradle.tooling.internal.provider.StartParamsValidatingActionExecuter.execute(StartParamsValidatingActionExecuter.java:32)
15:14:56.404              at org.gradle.tooling.internal.provider.SessionFailureReportingActionExecuter.execute(SessionFailureReportingActionExecuter.java:55)
15:14:56.404              at org.gradle.tooling.internal.provider.SessionFailureReportingActionExecuter.execute(SessionFailureReportingActionExecuter.java:41)
15:14:56.404              at org.gradle.tooling.internal.provider.SetupLoggingActionExecuter.execute(SetupLoggingActionExecuter.java:48)
15:14:56.404              at org.gradle.tooling.internal.provider.SetupLoggingActionExecuter.execute(SetupLoggingActionExecuter.java:32)
15:14:56.404              at org.gradle.launcher.daemon.server.exec.ExecuteBuild.doBuild(ExecuteBuild.java:67)
15:14:56.404              at org.gradle.launcher.daemon.server.exec.BuildCommandOnly.execute(BuildCommandOnly.java:36)
15:14:56.404              at org.gradle.launcher.daemon.server.api.DaemonCommandExecution.proceed(DaemonCommandExecution.java:104)
15:14:56.404              at org.gradle.launcher.daemon.server.exec.WatchForDisconnection.execute(WatchForDisconnection.java:37)
15:14:56.404              at org.gradle.launcher.daemon.server.api.DaemonCommandExecution.proceed(DaemonCommandExecution.java:104)
15:14:56.404              at org.gradle.launcher.daemon.server.exec.ResetDeprecationLogger.execute(ResetDeprecationLogger.java:26)
15:14:56.404              at org.gradle.launcher.daemon.server.api.DaemonCommandExecution.proceed(DaemonCommandExecution.java:104)
15:14:56.404              at org.gradle.launcher.daemon.server.exec.RequestStopIfSingleUsedDaemon.execute(RequestStopIfSingleUsedDaemon.java:34)
15:14:56.404              at org.gradle.launcher.daemon.server.api.DaemonCommandExecution.proceed(DaemonCommandExecution.java:104)
15:14:56.404              at org.gradle.launcher.daemon.server.exec.ForwardClientInput$2.call(ForwardClientInput.java:74)
15:14:56.404              at org.gradle.launcher.daemon.server.exec.ForwardClientInput$2.call(ForwardClientInput.java:72)
15:14:56.404              at org.gradle.util.Swapper.swap(Swapper.java:38)
15:14:56.404              at org.gradle.launcher.daemon.server.exec.ForwardClientInput.execute(ForwardClientInput.java:72)
15:14:56.404              at org.gradle.launcher.daemon.server.api.DaemonCommandExecution.proceed(DaemonCommandExecution.java:104)
15:14:56.404              at org.gradle.launcher.daemon.server.exec.LogAndCheckHealth.execute(LogAndCheckHealth.java:50)
15:14:56.404              at org.gradle.launcher.daemon.server.api.DaemonCommandExecution.proceed(DaemonCommandExecution.java:104)
15:14:56.404              at org.gradle.launcher.daemon.server.exec.LogToClient.doBuild(LogToClient.java:62)
15:14:56.404              at org.gradle.launcher.daemon.server.exec.BuildCommandOnly.execute(BuildCommandOnly.java:36)
15:14:56.404              at org.gradle.launcher.daemon.server.api.DaemonCommandExecution.proceed(DaemonCommandExecution.java:104)
15:14:56.404              at org.gradle.launcher.daemon.server.exec.EstablishBuildEnvironment.doBuild(EstablishBuildEnvironment.java:81)
15:14:56.404              at org.gradle.launcher.daemon.server.exec.BuildCommandOnly.execute(BuildCommandOnly.java:36)
15:14:56.404              at org.gradle.launcher.daemon.server.api.DaemonCommandExecution.proceed(DaemonCommandExecution.java:104)
15:14:56.404              at org.gradle.launcher.daemon.server.exec.StartBuildOrRespondWithBusy$1.run(StartBuildOrRespondWithBusy.java:50)
15:14:56.404              at org.gradle.launcher.daemon.server.DaemonStateCoordinator$1.run(DaemonStateCoordinator.java:295)
15:14:56.404              at org.gradle.internal.concurrent.ExecutorPolicy$CatchAndRecordFailures.onExecute(ExecutorPolicy.java:63)
15:14:56.404              at org.gradle.internal.concurrent.ManagedExecutorImpl$1.run(ManagedExecutorImpl.java:46)
15:14:56.404              at java.base/java.util.concurrent.ThreadPoolExecutor.runWorker(ThreadPoolExecutor.java:1128)
15:14:56.404              at java.base/java.util.concurrent.ThreadPoolExecutor$Worker.run(ThreadPoolExecutor.java:628)
15:14:56.404              at org.gradle.internal.concurrent.ThreadFactoryImpl$ManagedThreadRunnable.run(ThreadFactoryImpl.java:55)
15:14:56.404              at java.base/java.lang.Thread.run(Thread.java:830)
15:14:56.404          
15:14:56.404          1 error
15:14:56.404  
15:14:56.404  
15:14:56.404  * Try:
15:14:56.404  Run with --stacktrace option to get the stack trace. Run with --info or --debug option to get more log output. Run with --scan to get full insights.
15:14:56.404  
15:14:56.404  * Get more help at https://help.gradle.org
15:14:56.404  
15:14:56.404  BUILD FAILED in 13s
15:14:56.534  Android build failed (1) after 19 seconds
 



[TOPIC: post.html]
#8

vlads

[GLOBAL: userInfoPane.html]
vlads
  • Contributor

  • 972 posts
  • Corona Staff

Oh. This is different error. It wants you to install java 1.8 :)

[TOPIC: post.html]
#9

akhtarx5

[GLOBAL: userInfoPane.html]
akhtarx5
  • Enthusiast

  • 86 posts
  • Corona SDK

when i do java -version

it says

Version 8 update 221 (1.8.0_221-b11)

is this the wrong one i have installed

thankyou



[TOPIC: post.html]
#10

vlads

[GLOBAL: userInfoPane.html]
vlads
  • Contributor

  • 972 posts
  • Corona Staff

No... it’s the right one. Did you try to build some sample?

[TOPIC: post.html]
#11

akhtarx5

[GLOBAL: userInfoPane.html]
akhtarx5
  • Enthusiast

  • 86 posts
  • Corona SDK

hi tried inserting the v2 plugin code into the chains demo build file. it builds ok as normal

 

but when i insert the below code into the build.settings file it fails as before

 

build file for chains sample

------------------------------------

--
-- For more information on build.settings see the Project Build Settings Guide at:
-- http://docs.coronalabs.com/guide/distribution/buildSettings/index.html
--

settings =
{
    orientation =
    {
        default = "portrait",
        supported = { "portrait" }
    },
    iphone =
    {
        xcassets = "Images.xcassets",
        plist =
        {
            UILaunchStoryboardName = "LaunchScreen",
            ITSAppUsesNonExemptEncryption = false, -- This sample doesn't use custom encryption
        },
    },
    window =
    {
        titleText =
        {
            default = "Chains",
        },
    },
    plugins =
    {
        ["plugin.notifications.v2"] =
        {
            publisherId = "com.coronalabs"
        },
    },
}
 



[TOPIC: post.html]
#12

akhtarx5

[GLOBAL: userInfoPane.html]
akhtarx5
  • Enthusiast

  • 86 posts
  • Corona SDK

16:09:49.066  
16:09:49.066  Corona Simulator 2019.3531 (Sep 26 2019 04:20:50)
16:09:49.066  
16:09:49.066  
16:09:49.066  Copyright © 2009-2019  C o r o n a   L a b s   I n c .
16:09:49.066      Version: 3.0.0
16:09:49.066      Build: 2019.3531
16:09:49.066  Platform: SM-G900S / x64 / 6.1 / Intel® Iris™ Pro Graphics 5200 / 4.2.0 - Build 10.18.10.3345 / 2019.3531 / en_GB | GB | en_GB | en
16:09:49.066  Loading project from:   C:\Users\Windows-7\Desktop\Chains
16:09:49.066  Project sandbox folder: C:\Users\Windows-7\AppData\Local\Corona Labs\Corona Simulator\Sandbox\chains-D9ABF50021089943F6F91989014B470E\Documents
16:09:57.162  Testing credentials for 'C:\Program Files (x86)\Corona Labs\Corona\Resources\debug.keystore':
16:10:00.657  Picked up JAVA_TOOL_OPTIONS: -Duser.language=en
16:10:00.657  jar signed.
16:10:00.657  
16:10:00.657  Warning:
16:10:00.657  The signer's certificate is self-signed.
16:10:00.657  
16:10:00.657  The timestamp will expire on 2028-01-18.
16:10:03.716  Using custom build id from app bundle: 00000 (AppSettings.lua)
16:10:03.716  
16:10:03.716  Using custom Build Id 00000
16:10:26.337  @ver > NUL
16:10:26.337  Picked up JAVA_TOOL_OPTIONS: -Duser.language=en
16:10:26.337  Exception in thread "DisconnectableInputStream source reader" org.gradle.api.UncheckedIOException: java.io.IOException: Access is denied
16:10:26.337      at org.gradle.internal.UncheckedException.throwAsUncheckedException(UncheckedException.java:61)
16:10:26.337      at org.gradle.internal.UncheckedException.throwAsUncheckedException(UncheckedException.java:41)
16:10:26.337      at org.gradle.util.DisconnectableInputStream$1.run(DisconnectableInputStream.java:125)
16:10:26.337      at java.base/java.lang.Thread.run(Thread.java:830)
16:10:26.337  Caused by: java.io.IOException: Access is denied
16:10:26.337      at java.base/java.io.FileInputStream.readBytes(Native Method)
16:10:26.337      at java.base/java.io.FileInputStream.read(FileInputStream.java:273)
16:10:26.337      at java.base/java.io.BufferedInputStream.fill(BufferedInputStream.java:245)
16:10:26.337      at java.base/java.io.BufferedInputStream.read1(BufferedInputStream.java:285)
16:10:26.337      at java.base/java.io.BufferedInputStream.read(BufferedInputStream.java:344)
16:10:26.337      at org.gradle.util.DisconnectableInputStream$1.run(DisconnectableInputStream.java:96)
16:10:26.337      ... 1 more
16:10:26.337  ERROR: configuring 'shared.firebase.messaging_com.coronalabs' failed!
16:10:26.337  
16:10:26.337  FAILURE: Build failed with an exception.
16:10:26.337  
16:10:26.337  * Where:
16:10:26.337  Build file 'C:\Users\Windows-7\AppData\Local\Temp\Corona Labs\CLtmpa05692\template\app\build.gradle.kts' line: 277
16:10:26.337  
16:10:26.337  * What went wrong:
16:10:26.337  Could not open dsl remapped class cache for 21tjb5jf7wgv11saot1wddt1t (C:\Users\Windows-7\.gradle\caches\5.4.1\scripts-remapped\corona_712f816bt3vibm1phlsw2gipx\21tjb5jf7wgv11saot1wddt1t\dsldcd040730888da95d185715568c9cc57).
16:10:26.337  > Could not open dsl generic class cache for script 'C:\Users\Windows-7\AppData\Local\Temp\Corona Labs\CLtmpa05692\template\app\build\corona-plugins\shared.firebase.messaging_com.coronalabs\corona.gradle' (C:\Users\Windows-7\.gradle\caches\5.4.1\scripts\21tjb5jf7wgv11saot1wddt1t\dsl\dsldcd040730888da95d185715568c9cc57).
16:10:26.337     > Could not compile script 'C:\Users\Windows-7\AppData\Local\Temp\Corona Labs\CLtmpa05692\template\app\build\corona-plugins\shared.firebase.messaging_com.coronalabs\corona.gradle'.
16:10:26.337        > startup failed:
16:10:26.337          General error during semantic analysis: Unsupported class file major version 57
16:10:26.337          
16:10:26.337          java.lang.IllegalArgumentException: Unsupported class file major version 57
16:10:26.337              at groovyjarjarasm.asm.ClassReader.<init>(ClassReader.java:184)
16:10:26.337              at groovyjarjarasm.asm.ClassReader.<init>(ClassReader.java:166)
16:10:26.337              at groovyjarjarasm.asm.ClassReader.<init>(ClassReader.java:152)
16:10:26.337              at groovyjarjarasm.asm.ClassReader.<init>(ClassReader.java:273)
16:10:26.337              at org.codehaus.groovy.ast.decompiled.AsmDecompiler.parseClass(AsmDecompiler.java:81)
16:10:26.337              at org.codehaus.groovy.control.ClassNodeResolver.findDecompiled(ClassNodeResolver.java:254)
16:10:26.337              at org.codehaus.groovy.control.ClassNodeResolver.tryAsLoaderClassOrScript(ClassNodeResolver.java:192)
16:10:26.337              at org.codehaus.groovy.control.ClassNodeResolver.findClassNode(ClassNodeResolver.java:172)
16:10:26.337              at org.codehaus.groovy.control.ClassNodeResolver.resolveName(ClassNodeResolver.java:128)
16:10:26.337              at org.codehaus.groovy.ast.decompiled.AsmReferenceResolver.resolveClassNullable(AsmReferenceResolver.java:59)
16:10:26.337              at org.codehaus.groovy.ast.decompiled.AsmReferenceResolver.resolveClass(AsmReferenceResolver.java:46)
16:10:26.337              at org.codehaus.groovy.ast.decompiled.AsmReferenceResolver.resolveNonArrayType(AsmReferenceResolver.java:81)
16:10:26.337              at org.codehaus.groovy.ast.decompiled.AsmReferenceResolver.resolveType(AsmReferenceResolver.java:72)
16:10:26.337              at org.codehaus.groovy.ast.decompiled.MemberSignatureParser.createMethodNode(MemberSignatureParser.java:55)
16:10:26.337              at org.codehaus.groovy.ast.decompiled.DecompiledClassNode.lazyInitMembers(DecompiledClassNode.java:195)
16:10:26.337              at org.codehaus.groovy.ast.decompiled.DecompiledClassNode.getDeclaredMethods(DecompiledClassNode.java:121)
16:10:26.337              at org.codehaus.groovy.ast.ClassNode.getMethods(ClassNode.java:912)
16:10:26.337              at org.codehaus.groovy.ast.ClassNode.tryFindPossibleMethod(ClassNode.java:1280)
16:10:26.337              at org.codehaus.groovy.control.StaticImportVisitor.transformMethodCallExpression(StaticImportVisitor.java:252)
16:10:26.337              at org.codehaus.groovy.control.StaticImportVisitor.transform(StaticImportVisitor.java:112)
16:10:26.337              at org.codehaus.groovy.ast.ClassCodeExpressionTransformer.visitExpressionStatement(ClassCodeExpressionTransformer.java:144)
16:10:26.337              at org.codehaus.groovy.ast.stmt.ExpressionStatement.visit(ExpressionStatement.java:42)
16:10:26.337              at org.codehaus.groovy.ast.ClassCodeVisitorSupport.visitClassCodeContainer(ClassCodeVisitorSupport.java:110)
16:10:26.337              at org.codehaus.groovy.ast.ClassCodeVisitorSupport.visitConstructorOrMethod(ClassCodeVisitorSupport.java:121)
16:10:26.337              at org.codehaus.groovy.ast.ClassCodeExpressionTransformer.visitConstructorOrMethod(ClassCodeExpressionTransformer.java:55)
16:10:26.337              at org.codehaus.groovy.control.StaticImportVisitor.visitConstructorOrMethod(StaticImportVisitor.java:88)
16:10:26.337              at org.codehaus.groovy.ast.ClassCodeVisitorSupport.visitConstructor(ClassCodeVisitorSupport.java:128)
16:10:26.337              at org.codehaus.groovy.ast.ClassNode.visitContents(ClassNode.java:1099)
16:10:26.337              at org.codehaus.groovy.ast.ClassCodeVisitorSupport.visitClass(ClassCodeVisitorSupport.java:54)
16:10:26.337              at org.codehaus.groovy.control.StaticImportVisitor.visitClass(StaticImportVisitor.java:82)
16:10:26.337              at org.codehaus.groovy.control.CompilationUnit$14.call(CompilationUnit.java:717)
16:10:26.337              at org.codehaus.groovy.control.CompilationUnit.applyToPrimaryClassNodes(CompilationUnit.java:1095)
16:10:26.337              at org.codehaus.groovy.control.CompilationUnit.doPhaseOperation(CompilationUnit.java:649)
16:10:26.337              at org.codehaus.groovy.control.CompilationUnit.processPhaseOperations(CompilationUnit.java:627)
16:10:26.337              at org.codehaus.groovy.control.CompilationUnit.compile(CompilationUnit.java:604)
16:10:26.337              at groovy.lang.GroovyClassLoader.doParseClass(GroovyClassLoader.java:390)
16:10:26.337              at groovy.lang.GroovyClassLoader.access$300(GroovyClassLoader.java:89)
16:10:26.337              at groovy.lang.GroovyClassLoader$5.provide(GroovyClassLoader.java:330)
16:10:26.337              at groovy.lang.GroovyClassLoader$5.provide(GroovyClassLoader.java:327)
16:10:26.337              at org.codehaus.groovy.runtime.memoize.ConcurrentCommonCache.getAndPut(ConcurrentCommonCache.java:147)
16:10:26.337              at groovy.lang.GroovyClassLoader.parseClass(GroovyClassLoader.java:325)
16:10:26.337              at org.gradle.groovy.scripts.internal.DefaultScriptCompilationHandler.compileScript(DefaultScriptCompilationHandler.java:133)
16:10:26.337              at org.gradle.groovy.scripts.internal.DefaultScriptCompilationHandler.compileToDir(DefaultScriptCompilationHandler.java:93)
16:10:26.337              at org.gradle.groovy.scripts.internal.BuildOperationBackedScriptCompilationHandler$2.run(BuildOperationBackedScriptCompilationHandler.java:54)
16:10:26.337              at org.gradle.internal.operations.DefaultBuildOperationExecutor$RunnableBuildOperationWorker.execute(DefaultBuildOperationExecutor.java:402)
16:10:26.337              at org.gradle.internal.operations.DefaultBuildOperationExecutor$RunnableBuildOperationWorker.execute(DefaultBuildOperationExecutor.java:394)
16:10:26.337              at org.gradle.internal.operations.DefaultBuildOperationExecutor$1.execute(DefaultBuildOperationExecutor.java:165)
16:10:26.337              at org.gradle.internal.operations.DefaultBuildOperationExecutor.execute(DefaultBuildOperationExecutor.java:250)
16:10:26.337              at org.gradle.internal.operations.DefaultBuildOperationExecutor.execute(DefaultBuildOperationExecutor.java:158)
16:10:26.337              at org.gradle.internal.operations.DefaultBuildOperationExecutor.run(DefaultBuildOperationExecutor.java:92)
16:10:26.337              at org.gradle.internal.operations.DelegatingBuildOperationExecutor.run(DelegatingBuildOperationExecutor.java:31)
16:10:26.337              at org.gradle.groovy.scripts.internal.BuildOperationBackedScriptCompilationHandler.compileToDir(BuildOperationBackedScriptCompilationHandler.java:51)
16:10:26.337              at org.gradle.groovy.scripts.internal.FileCacheBackedScriptClassCompiler$CompileToCrossBuildCacheAction.execute(FileCacheBackedScriptClassCompiler.java:151)
16:10:26.337              at org.gradle.groovy.scripts.internal.FileCacheBackedScriptClassCompiler$CompileToCrossBuildCacheAction.execute(FileCacheBackedScriptClassCompiler.java:132)
16:10:26.337              at org.gradle.groovy.scripts.internal.FileCacheBackedScriptClassCompiler$ProgressReportingInitializer.execute(FileCacheBackedScriptClassCompiler.java:175)
16:10:26.337              at org.gradle.groovy.scripts.internal.FileCacheBackedScriptClassCompiler$ProgressReportingInitializer.execute(FileCacheBackedScriptClassCompiler.java:155)
16:10:26.337              at org.gradle.cache.internal.DefaultPersistentDirectoryCache$Initializer.initialize(DefaultPersistentDirectoryCache.java:98)
16:10:26.337              at org.gradle.cache.internal.FixedSharedModeCrossProcessCacheAccess$1.run(FixedSharedModeCrossProcessCacheAccess.java:85)
16:10:26.337              at org.gradle.cache.internal.DefaultFileLockManager$DefaultFileLock.doWriteAction(DefaultFileLockManager.java:207)
16:10:26.337              at org.gradle.cache.internal.DefaultFileLockManager$DefaultFileLock.writeFile(DefaultFileLockManager.java:197)
16:10:26.337              at org.gradle.cache.internal.FixedSharedModeCrossProcessCacheAccess.open(FixedSharedModeCrossProcessCacheAccess.java:83)
16:10:26.337              at org.gradle.cache.internal.DefaultCacheAccess.open(DefaultCacheAccess.java:142)
16:10:26.337              at org.gradle.cache.internal.DefaultPersistentDirectoryStore.open(DefaultPersistentDirectoryStore.java:78)
16:10:26.337              at org.gradle.cache.internal.DefaultPersistentDirectoryStore.open(DefaultPersistentDirectoryStore.java:42)
16:10:26.337              at org.gradle.cache.internal.DefaultCacheFactory.doOpen(DefaultCacheFactory.java:94)
16:10:26.337              at org.gradle.cache.internal.DefaultCacheFactory.open(DefaultCacheFactory.java:68)
16:10:26.337              at org.gradle.cache.internal.DefaultCacheRepository$PersistentCacheBuilder.open(DefaultCacheRepository.java:118)
16:10:26.337              at org.gradle.groovy.scripts.internal.FileCacheBackedScriptClassCompiler$RemapBuildScriptsAction.execute(FileCacheBackedScriptClassCompiler.java:421)
16:10:26.337              at org.gradle.groovy.scripts.internal.FileCacheBackedScriptClassCompiler$RemapBuildScriptsAction.execute(FileCacheBackedScriptClassCompiler.java:390)
16:10:26.337              at org.gradle.groovy.scripts.internal.FileCacheBackedScriptClassCompiler$ProgressReportingInitializer.execute(FileCacheBackedScriptClassCompiler.java:175)
16:10:26.337              at org.gradle.groovy.scripts.internal.FileCacheBackedScriptClassCompiler$ProgressReportingInitializer.execute(FileCacheBackedScriptClassCompiler.java:155)
16:10:26.337              at org.gradle.cache.internal.DefaultPersistentDirectoryCache$Initializer.initialize(DefaultPersistentDirectoryCache.java:98)
16:10:26.337              at org.gradle.cache.internal.FixedSharedModeCrossProcessCacheAccess$1.run(FixedSharedModeCrossProcessCacheAccess.java:85)
16:10:26.337              at org.gradle.cache.internal.DefaultFileLockManager$DefaultFileLock.doWriteAction(DefaultFileLockManager.java:207)
16:10:26.337              at org.gradle.cache.internal.DefaultFileLockManager$DefaultFileLock.writeFile(DefaultFileLockManager.java:197)
16:10:26.337              at org.gradle.cache.internal.FixedSharedModeCrossProcessCacheAccess.open(FixedSharedModeCrossProcessCacheAccess.java:83)
16:10:26.337              at org.gradle.cache.internal.DefaultCacheAccess.open(DefaultCacheAccess.java:142)
16:10:26.337              at org.gradle.cache.internal.DefaultPersistentDirectoryStore.open(DefaultPersistentDirectoryStore.java:78)
16:10:26.337              at org.gradle.cache.internal.DefaultPersistentDirectoryStore.open(DefaultPersistentDirectoryStore.java:42)
16:10:26.337              at org.gradle.cache.internal.DefaultCacheFactory.doOpen(DefaultCacheFactory.java:94)
16:10:26.337              at org.gradle.cache.internal.DefaultCacheFactory.open(DefaultCacheFactory.java:68)
16:10:26.337              at org.gradle.cache.internal.DefaultCacheRepository$PersistentCacheBuilder.open(DefaultCacheRepository.java:118)
16:10:26.337              at org.gradle.groovy.scripts.internal.FileCacheBackedScriptClassCompiler.compile(FileCacheBackedScriptClassCompiler.java:105)
16:10:26.337              at org.gradle.groovy.scripts.internal.CrossBuildInMemoryCachingScriptClassCache.getOrCompile(CrossBuildInMemoryCachingScriptClassCache.java:49)
16:10:26.337              at org.gradle.groovy.scripts.internal.BuildScopeInMemoryCachingScriptClassCompiler.compile(BuildScopeInMemoryCachingScriptClassCompiler.java:50)
16:10:26.337              at org.gradle.groovy.scripts.DefaultScriptCompilerFactory$ScriptCompilerImpl.compile(DefaultScriptCompilerFactory.java:50)
16:10:26.337              at org.gradle.configuration.DefaultScriptPluginFactory$ScriptPluginImpl.apply(DefaultScriptPluginFactory.java:211)
16:10:26.337              at org.gradle.configuration.BuildOperationScriptPlugin$1$1.run(BuildOperationScriptPlugin.java:69)
16:10:26.337              at org.gradle.internal.operations.DefaultBuildOperationExecutor$RunnableBuildOperationWorker.execute(DefaultBuildOperationExecutor.java:402)
16:10:26.337              at org.gradle.internal.operations.DefaultBuildOperationExecutor$RunnableBuildOperationWorker.execute(DefaultBuildOperationExecutor.java:394)
16:10:26.337              at org.gradle.internal.operations.DefaultBuildOperationExecutor$1.execute(DefaultBuildOperationExecutor.java:165)
16:10:26.337              at org.gradle.internal.operations.DefaultBuildOperationExecutor.execute(DefaultBuildOperationExecutor.java:250)
16:10:26.337              at org.gradle.internal.operations.DefaultBuildOperationExecutor.execute(DefaultBuildOperationExecutor.java:158)
16:10:26.337              at org.gradle.internal.operations.DefaultBuildOperationExecutor.run(DefaultBuildOperationExecutor.java:92)
16:10:26.337              at org.gradle.internal.operations.DelegatingBuildOperationExecutor.run(DelegatingBuildOperationExecutor.java:31)
16:10:26.337              at org.gradle.configuration.BuildOperationScriptPlugin$1.execute(BuildOperationScriptPlugin.java:66)
16:10:26.337              at org.gradle.configuration.BuildOperationScriptPlugin$1.execute(BuildOperationScriptPlugin.java:63)
16:10:26.337              at org.gradle.configuration.internal.DefaultUserCodeApplicationContext.apply(DefaultUserCodeApplicationContext.java:48)
16:10:26.337              at org.gradle.configuration.BuildOperationScriptPlugin.apply(BuildOperationScriptPlugin.java:63)
16:10:26.337              at org.gradle.api.internal.plugins.DefaultObjectConfigurationAction.applyScript(DefaultObjectConfigurationAction.java:109)
16:10:26.337              at org.gradle.api.internal.plugins.DefaultObjectConfigurationAction.access$000(DefaultObjectConfigurationAction.java:38)
16:10:26.337              at org.gradle.api.internal.plugins.DefaultObjectConfigurationAction$1.run(DefaultObjectConfigurationAction.java:68)
16:10:26.337              at org.gradle.api.internal.plugins.DefaultObjectConfigurationAction.execute(DefaultObjectConfigurationAction.java:143)
16:10:26.337              at org.gradle.api.internal.project.AbstractPluginAware.apply(AbstractPluginAware.java:40)
16:10:26.337              at org.gradle.kotlin.dsl.support.delegates.ProjectDelegate.apply(ProjectDelegate.kt:344)
16:10:26.337              at org.gradle.kotlin.dsl.PluginAwareExtensionsKt.apply(PluginAwareExtensions.kt:33)
16:10:26.337              at org.gradle.kotlin.dsl.PluginAwareExtensionsKt.apply$default(PluginAwareExtensions.kt:31)
16:10:26.337              at Build_gradle.processPluginGradleScripts(build.gradle.kts:277)
16:10:26.337              at Build_gradle.downloadAndProcessCoronaPlugins(build.gradle.kts:607)
16:10:26.337              at Build_gradle.downloadAndProcessCoronaPlugins$default(build.gradle.kts:550)
16:10:26.337              at Build_gradle.<init>(build.gradle.kts:179)
16:10:26.337              at Program.execute(Unknown Source)
16:10:26.337              at org.gradle.kotlin.dsl.execution.Interpreter$ProgramHost.eval(Interpreter.kt:506)
16:10:26.337              at org.gradle.kotlin.dsl.execution.Interpreter$ProgramHost.evaluateSecondStageOf(Interpreter.kt:422)
16:10:26.337              at Program.execute(Unknown Source)
16:10:26.337              at org.gradle.kotlin.dsl.execution.Interpreter$ProgramHost.eval(Interpreter.kt:506)
16:10:26.337              at org.gradle.kotlin.dsl.execution.Interpreter.eval(Interpreter.kt:206)
16:10:26.337              at org.gradle.kotlin.dsl.provider.StandardKotlinScriptEvaluator.evaluate(KotlinScriptEvaluator.kt:114)
16:10:26.337              at org.gradle.kotlin.dsl.provider.KotlinScriptPluginFactory$create$1.invoke(KotlinScriptPluginFactory.kt:51)
16:10:26.337              at org.gradle.kotlin.dsl.provider.KotlinScriptPluginFactory$create$1.invoke(KotlinScriptPluginFactory.kt:36)
16:10:26.337              at org.gradle.kotlin.dsl.provider.KotlinScriptPlugin.apply(KotlinScriptPlugin.kt:34)
16:10:26.337              at org.gradle.configuration.BuildOperationScriptPlugin$1$1.run(BuildOperationScriptPlugin.java:69)
16:10:26.337              at org.gradle.internal.operations.DefaultBuildOperationExecutor$RunnableBuildOperationWorker.execute(DefaultBuildOperationExecutor.java:402)
16:10:26.337              at org.gradle.internal.operations.DefaultBuildOperationExecutor$RunnableBuildOperationWorker.execute(DefaultBuildOperationExecutor.java:394)
16:10:26.337              at org.gradle.internal.operations.DefaultBuildOperationExecutor$1.execute(DefaultBuildOperationExecutor.java:165)
16:10:26.337              at org.gradle.internal.operations.DefaultBuildOperationExecutor.execute(DefaultBuildOperationExecutor.java:250)
16:10:26.337              at org.gradle.internal.operations.DefaultBuildOperationExecutor.execute(DefaultBuildOperationExecutor.java:158)
16:10:26.337              at org.gradle.internal.operations.DefaultBuildOperationExecutor.run(DefaultBuildOperationExecutor.java:92)
16:10:26.337              at org.gradle.internal.operations.DelegatingBuildOperationExecutor.run(DelegatingBuildOperationExecutor.java:31)
16:10:26.337              at org.gradle.configuration.BuildOperationScriptPlugin$1.execute(BuildOperationScriptPlugin.java:66)
16:10:26.337              at org.gradle.configuration.BuildOperationScriptPlugin$1.execute(BuildOperationScriptPlugin.java:63)
16:10:26.337              at org.gradle.configuration.internal.DefaultUserCodeApplicationContext.apply(DefaultUserCodeApplicationContext.java:48)
16:10:26.337              at org.gradle.configuration.BuildOperationScriptPlugin.apply(BuildOperationScriptPlugin.java:63)
16:10:26.337              at org.gradle.configuration.project.BuildScriptProcessor$1.run(BuildScriptProcessor.java:44)
16:10:26.337              at org.gradle.internal.Factories$1.create(Factories.java:25)
16:10:26.337              at org.gradle.api.internal.project.DefaultProjectStateRegistry$ProjectStateImpl.withMutableState(DefaultProjectStateRegistry.java:200)
16:10:26.337              at org.gradle.api.internal.project.DefaultProjectStateRegistry$ProjectStateImpl.withMutableState(DefaultProjectStateRegistry.java:186)
16:10:26.337              at org.gradle.configuration.project.BuildScriptProcessor.execute(BuildScriptProcessor.java:41)
16:10:26.337              at org.gradle.configuration.project.BuildScriptProcessor.execute(BuildScriptProcessor.java:26)
16:10:26.337              at org.gradle.configuration.project.ConfigureActionsProjectEvaluator.evaluate(ConfigureActionsProjectEvaluator.java:34)
16:10:26.337              at org.gradle.configuration.project.LifecycleProjectEvaluator$EvaluateProject$1.run(LifecycleProjectEvaluator.java:106)
16:10:26.337              at org.gradle.internal.Factories$1.create(Factories.java:25)
16:10:26.337              at org.gradle.internal.work.DefaultWorkerLeaseService.withLocks(DefaultWorkerLeaseService.java:183)
16:10:26.337              at org.gradle.internal.work.StopShieldingWorkerLeaseService.withLocks(StopShieldingWorkerLeaseService.java:40)
16:10:26.337              at org.gradle.api.internal.project.DefaultProjectStateRegistry$ProjectStateImpl.withProjectLock(DefaultProjectStateRegistry.java:226)
16:10:26.337              at org.gradle.api.internal.project.DefaultProjectStateRegistry$ProjectStateImpl.withMutableState(DefaultProjectStateRegistry.java:220)
16:10:26.337              at org.gradle.api.internal.project.DefaultProjectStateRegistry$ProjectStateImpl.withMutableState(DefaultProjectStateRegistry.java:186)
16:10:26.337              at org.gradle.configuration.project.LifecycleProjectEvaluator$EvaluateProject.run(LifecycleProjectEvaluator.java:95)
16:10:26.337              at org.gradle.internal.operations.DefaultBuildOperationExecutor$RunnableBuildOperationWorker.execute(DefaultBuildOperationExecutor.java:402)
16:10:26.337              at org.gradle.internal.operations.DefaultBuildOperationExecutor$RunnableBuildOperationWorker.execute(DefaultBuildOperationExecutor.java:394)
16:10:26.337              at org.gradle.internal.operations.DefaultBuildOperationExecutor$1.execute(DefaultBuildOperationExecutor.java:165)
16:10:26.337              at org.gradle.internal.operations.DefaultBuildOperationExecutor.execute(DefaultBuildOperationExecutor.java:250)
16:10:26.337              at org.gradle.internal.operations.DefaultBuildOperationExecutor.execute(DefaultBuildOperationExecutor.java:158)
16:10:26.337              at org.gradle.internal.operations.DefaultBuildOperationExecutor.run(DefaultBuildOperationExecutor.java:92)
16:10:26.337              at org.gradle.internal.operations.DelegatingBuildOperationExecutor.run(DelegatingBuildOperationExecutor.java:31)
16:10:26.337              at org.gradle.configuration.project.LifecycleProjectEvaluator.evaluate(LifecycleProjectEvaluator.java:67)
16:10:26.337              at org.gradle.api.internal.project.DefaultProject.evaluate(DefaultProject.java:695)
16:10:26.337              at org.gradle.api.internal.project.DefaultProject.evaluate(DefaultProject.java:143)
16:10:26.337              at org.gradle.execution.TaskPathProjectEvaluator.configure(TaskPathProjectEvaluator.java:35)
16:10:26.337              at org.gradle.execution.TaskPathProjectEvaluator.configureHierarchy(TaskPathProjectEvaluator.java:62)
16:10:26.337              at org.gradle.configuration.DefaultBuildConfigurer.configure(DefaultBuildConfigurer.java:41)
16:10:26.337              at org.gradle.initialization.DefaultGradleLauncher$ConfigureBuild.run(DefaultGradleLauncher.java:302)
16:10:26.337              at org.gradle.internal.operations.DefaultBuildOperationExecutor$RunnableBuildOperationWorker.execute(DefaultBuildOperationExecutor.java:402)
16:10:26.337              at org.gradle.internal.operations.DefaultBuildOperationExecutor$RunnableBuildOperationWorker.execute(DefaultBuildOperationExecutor.java:394)
16:10:26.337              at org.gradle.internal.operations.DefaultBuildOperationExecutor$1.execute(DefaultBuildOperationExecutor.java:165)
16:10:26.337              at org.gradle.internal.operations.DefaultBuildOperationExecutor.execute(DefaultBuildOperationExecutor.java:250)
16:10:26.337              at org.gradle.internal.operations.DefaultBuildOperationExecutor.execute(DefaultBuildOperationExecutor.java:158)
16:10:26.337              at org.gradle.internal.operations.DefaultBuildOperationExecutor.run(DefaultBuildOperationExecutor.java:92)
16:10:26.337              at org.gradle.internal.operations.DelegatingBuildOperationExecutor.run(DelegatingBuildOperationExecutor.java:31)
16:10:26.337              at org.gradle.initialization.DefaultGradleLauncher.configureBuild(DefaultGradleLauncher.java:210)
16:10:26.337              at org.gradle.initialization.DefaultGradleLauncher.doBuildStages(DefaultGradleLauncher.java:151)
16:10:26.337              at org.gradle.initialization.DefaultGradleLauncher.executeTasks(DefaultGradleLauncher.java:134)
16:10:26.337              at org.gradle.internal.invocation.GradleBuildController$1.execute(GradleBuildController.java:58)
16:10:26.337              at org.gradle.internal.invocation.GradleBuildController$1.execute(GradleBuildController.java:55)
16:10:26.337              at org.gradle.internal.invocation.GradleBuildController$3.create(GradleBuildController.java:82)
16:10:26.337              at org.gradle.internal.invocation.GradleBuildController$3.create(GradleBuildController.java:75)
16:10:26.337              at org.gradle.internal.work.DefaultWorkerLeaseService.withLocks(DefaultWorkerLeaseService.java:183)
16:10:26.337              at org.gradle.internal.work.StopShieldingWorkerLeaseService.withLocks(StopShieldingWorkerLeaseService.java:40)
16:10:26.337              at org.gradle.internal.invocation.GradleBuildController.doBuild(GradleBuildController.java:75)
16:10:26.337              at org.gradle.internal.invocation.GradleBuildController.run(GradleBuildController.java:55)
16:10:26.337              at org.gradle.tooling.internal.provider.ExecuteBuildActionRunner.run(ExecuteBuildActionRunner.java:31)
16:10:26.337              at org.gradle.launcher.exec.ChainingBuildActionRunner.run(ChainingBuildActionRunner.java:35)
16:10:26.337              at org.gradle.launcher.exec.BuildOutcomeReportingBuildActionRunner.run(BuildOutcomeReportingBuildActionRunner.java:58)
16:10:26.337              at org.gradle.tooling.internal.provider.ValidatingBuildActionRunner.run(ValidatingBuildActionRunner.java:32)
16:10:26.337              at org.gradle.launcher.exec.BuildCompletionNotifyingBuildActionRunner.run(BuildCompletionNotifyingBuildActionRunner.java:39)
16:10:26.337              at org.gradle.launcher.exec.RunAsBuildOperationBuildActionRunner$3.call(RunAsBuildOperationBuildActionRunner.java:51)
16:10:26.337              at org.gradle.launcher.exec.RunAsBuildOperationBuildActionRunner$3.call(RunAsBuildOperationBuildActionRunner.java:45)
16:10:26.337              at org.gradle.internal.operations.DefaultBuildOperationExecutor$CallableBuildOperationWorker.execute(DefaultBuildOperationExecutor.java:416)
16:10:26.337              at org.gradle.internal.operations.DefaultBuildOperationExecutor$CallableBuildOperationWorker.execute(DefaultBuildOperationExecutor.java:406)
16:10:26.337              at org.gradle.internal.operations.DefaultBuildOperationExecutor$1.execute(DefaultBuildOperationExecutor.java:165)
16:10:26.337              at org.gradle.internal.operations.DefaultBuildOperationExecutor.execute(DefaultBuildOperationExecutor.java:250)
16:10:26.337              at org.gradle.internal.operations.DefaultBuildOperationExecutor.execute(DefaultBuildOperationExecutor.java:158)
16:10:26.337              at org.gradle.internal.operations.DefaultBuildOperationExecutor.call(DefaultBuildOperationExecutor.java:102)
16:10:26.337              at org.gradle.internal.operations.DelegatingBuildOperationExecutor.call(DelegatingBuildOperationExecutor.java:36)
16:10:26.337              at org.gradle.launcher.exec.RunAsBuildOperationBuildActionRunner.run(RunAsBuildOperationBuildActionRunner.java:45)
16:10:26.337              at org.gradle.launcher.exec.InProcessBuildActionExecuter$1.transform(InProcessBuildActionExecuter.java:49)
16:10:26.337              at org.gradle.launcher.exec.InProcessBuildActionExecuter$1.transform(InProcessBuildActionExecuter.java:46)
16:10:26.337              at org.gradle.composite.internal.DefaultRootBuildState.run(DefaultRootBuildState.java:78)
16:10:26.337              at org.gradle.launcher.exec.InProcessBuildActionExecuter.execute(InProcessBuildActionExecuter.java:46)
16:10:26.337              at org.gradle.launcher.exec.InProcessBuildActionExecuter.execute(InProcessBuildActionExecuter.java:31)
16:10:26.337              at org.gradle.launcher.exec.BuildTreeScopeBuildActionExecuter.execute(BuildTreeScopeBuildActionExecuter.java:42)
16:10:26.337              at org.gradle.launcher.exec.BuildTreeScopeBuildActionExecuter.execute(BuildTreeScopeBuildActionExecuter.java:28)
16:10:26.337              at org.gradle.tooling.internal.provider.ContinuousBuildActionExecuter.execute(ContinuousBuildActionExecuter.java:78)
16:10:26.337              at org.gradle.tooling.internal.provider.ContinuousBuildActionExecuter.execute(ContinuousBuildActionExecuter.java:52)
16:10:26.337              at org.gradle.tooling.internal.provider.SubscribableBuildActionExecuter.execute(SubscribableBuildActionExecuter.java:59)
16:10:26.337              at org.gradle.tooling.internal.provider.SubscribableBuildActionExecuter.execute(SubscribableBuildActionExecuter.java:36)
16:10:26.337              at org.gradle.tooling.internal.provider.SessionScopeBuildActionExecuter.execute(SessionScopeBuildActionExecuter.java:68)
16:10:26.337              at org.gradle.tooling.internal.provider.SessionScopeBuildActionExecuter.execute(SessionScopeBuildActionExecuter.java:38)
16:10:26.337              at org.gradle.tooling.internal.provider.GradleThreadBuildActionExecuter.execute(GradleThreadBuildActionExecuter.java:37)
16:10:26.337              at org.gradle.tooling.internal.provider.GradleThreadBuildActionExecuter.execute(GradleThreadBuildActionExecuter.java:26)
16:10:26.337              at org.gradle.tooling.internal.provider.ParallelismConfigurationBuildActionExecuter.execute(ParallelismConfigurationBuildActionExecuter.java:43)
16:10:26.337              at org.gradle.tooling.internal.provider.ParallelismConfigurationBuildActionExecuter.execute(ParallelismConfigurationBuildActionExecuter.java:29)
16:10:26.337              at org.gradle.tooling.internal.provider.StartParamsValidatingActionExecuter.execute(StartParamsValidatingActionExecuter.java:60)
16:10:26.337              at org.gradle.tooling.internal.provider.StartParamsValidatingActionExecuter.execute(StartParamsValidatingActionExecuter.java:32)
16:10:26.337              at org.gradle.tooling.internal.provider.SessionFailureReportingActionExecuter.execute(SessionFailureReportingActionExecuter.java:55)
16:10:26.337              at org.gradle.tooling.internal.provider.SessionFailureReportingActionExecuter.execute(SessionFailureReportingActionExecuter.java:41)
16:10:26.337              at org.gradle.tooling.internal.provider.SetupLoggingActionExecuter.execute(SetupLoggingActionExecuter.java:48)
16:10:26.337              at org.gradle.tooling.internal.provider.SetupLoggingActionExecuter.execute(SetupLoggingActionExecuter.java:32)
16:10:26.337              at org.gradle.launcher.daemon.server.exec.ExecuteBuild.doBuild(ExecuteBuild.java:67)
16:10:26.337              at org.gradle.launcher.daemon.server.exec.BuildCommandOnly.execute(BuildCommandOnly.java:36)
16:10:26.337              at org.gradle.launcher.daemon.server.api.DaemonCommandExecution.proceed(DaemonCommandExecution.java:104)
16:10:26.337              at org.gradle.launcher.daemon.server.exec.WatchForDisconnection.execute(WatchForDisconnection.java:37)
16:10:26.337              at org.gradle.launcher.daemon.server.api.DaemonCommandExecution.proceed(DaemonCommandExecution.java:104)
16:10:26.337              at org.gradle.launcher.daemon.server.exec.ResetDeprecationLogger.execute(ResetDeprecationLogger.java:26)
16:10:26.337              at org.gradle.launcher.daemon.server.api.DaemonCommandExecution.proceed(DaemonCommandExecution.java:104)
16:10:26.337              at org.gradle.launcher.daemon.server.exec.RequestStopIfSingleUsedDaemon.execute(RequestStopIfSingleUsedDaemon.java:34)
16:10:26.337              at org.gradle.launcher.daemon.server.api.DaemonCommandExecution.proceed(DaemonCommandExecution.java:104)
16:10:26.337              at org.gradle.launcher.daemon.server.exec.ForwardClientInput$2.call(ForwardClientInput.java:74)
16:10:26.337              at org.gradle.launcher.daemon.server.exec.ForwardClientInput$2.call(ForwardClientInput.java:72)
16:10:26.337              at org.gradle.util.Swapper.swap(Swapper.java:38)
16:10:26.337              at org.gradle.launcher.daemon.server.exec.ForwardClientInput.execute(ForwardClientInput.java:72)
16:10:26.337              at org.gradle.launcher.daemon.server.api.DaemonCommandExecution.proceed(DaemonCommandExecution.java:104)
16:10:26.337              at org.gradle.launcher.daemon.server.exec.LogAndCheckHealth.execute(LogAndCheckHealth.java:50)
16:10:26.337              at org.gradle.launcher.daemon.server.api.DaemonCommandExecution.proceed(DaemonCommandExecution.java:104)
16:10:26.337              at org.gradle.launcher.daemon.server.exec.LogToClient.doBuild(LogToClient.java:62)
16:10:26.337              at org.gradle.launcher.daemon.server.exec.BuildCommandOnly.execute(BuildCommandOnly.java:36)
16:10:26.337              at org.gradle.launcher.daemon.server.api.DaemonCommandExecution.proceed(DaemonCommandExecution.java:104)
16:10:26.337              at org.gradle.launcher.daemon.server.exec.EstablishBuildEnvironment.doBuild(EstablishBuildEnvironment.java:81)
16:10:26.337              at org.gradle.launcher.daemon.server.exec.BuildCommandOnly.execute(BuildCommandOnly.java:36)
16:10:26.337              at org.gradle.launcher.daemon.server.api.DaemonCommandExecution.proceed(DaemonCommandExecution.java:104)
16:10:26.337              at org.gradle.launcher.daemon.server.exec.StartBuildOrRespondWithBusy$1.run(StartBuildOrRespondWithBusy.java:50)
16:10:26.337              at org.gradle.launcher.daemon.server.DaemonStateCoordinator$1.run(DaemonStateCoordinator.java:295)
16:10:26.337              at org.gradle.internal.concurrent.ExecutorPolicy$CatchAndRecordFailures.onExecute(ExecutorPolicy.java:63)
16:10:26.337              at org.gradle.internal.concurrent.ManagedExecutorImpl$1.run(ManagedExecutorImpl.java:46)
16:10:26.337              at java.base/java.util.concurrent.ThreadPoolExecutor.runWorker(ThreadPoolExecutor.java:1128)
16:10:26.337              at java.base/java.util.concurrent.ThreadPoolExecutor$Worker.run(ThreadPoolExecutor.java:628)
16:10:26.337              at org.gradle.internal.concurrent.ThreadFactoryImpl$ManagedThreadRunnable.run(ThreadFactoryImpl.java:55)
16:10:26.337              at java.base/java.lang.Thread.run(Thread.java:830)
16:10:26.337          
16:10:26.337          1 error
16:10:26.337  
16:10:26.337  
16:10:26.337  * Try:
16:10:26.337  Run with --stacktrace option to get the stack trace. Run with --info or --debug option to get more log output. Run with --scan to get full insights.
16:10:26.337  
16:10:26.337  * Get more help at https://help.gradle.org
16:10:26.337  
16:10:26.337  BUILD FAILED in 17s
16:10:26.555  Android build failed (1) after 23 seconds
 



[TOPIC: post.html]
#13

akhtarx5

[GLOBAL: userInfoPane.html]
akhtarx5
  • Enthusiast

  • 86 posts
  • Corona SDK

Just wondering are you able to build this.

 

Chains demo

 

with plugin v2 code inserted in build settings

 

thankyou

Attached Files



[TOPIC: post.html]
#14

vlads

[GLOBAL: userInfoPane.html]
vlads
  • Contributor

  • 972 posts
  • Corona Staff

Can you build any sample without any plugins?

[TOPIC: post.html]
#15

akhtarx5

[GLOBAL: userInfoPane.html]
akhtarx5
  • Enthusiast

  • 86 posts
  • Corona SDK

Sample files build fine,  i have tried Chains and Bridge from sample physics directory

 

as soon as i add the below lines in Build settings the failure happens

 

{
        ["plugin.notifications.v2"] =
        {
            publisherId = "com.coronalabs"
        },
    },

 

attached Bridge with adjusted build settings

 

 

 

 

Attached Files



[TOPIC: post.html]
#16

vlads

[GLOBAL: userInfoPane.html]
vlads
  • Contributor

  • 972 posts
  • Corona Staff

Yes, builds just fine.



[TOPIC: post.html]
#17

akhtarx5

[GLOBAL: userInfoPane.html]
akhtarx5
  • Enthusiast

  • 86 posts
  • Corona SDK

i am getting the following error with all failed builds

although only using localnotifications and not firebase

 

 

Error:Configuring 'shared.firebase.messaging_com.coronalabs'failed



[TOPIC: post.html]
#18

vlads

[GLOBAL: userInfoPane.html]
vlads
  • Contributor

  • 972 posts
  • Corona Staff

nah, it isn't the error you're getting. This is some log output issue, it doesn't break the build. Your error is

 

16:10:26.337          General error during semantic analysis: Unsupported class file major version 57
16:10:26.337          
16:10:26.337          java.lang.IllegalArgumentException: Unsupported class file major version 57

 

When trying to integrate the messaging plugin. This is very worrisome. This message usually pops up when some Java classes are too old or too new. May be try newer Java?



[TOPIC: post.html]
#19

akhtarx5

[GLOBAL: userInfoPane.html]
akhtarx5
  • Enthusiast

  • 86 posts
  • Corona SDK

Got a message trying to build the chains demo today

 

seems to want to download notifications.v2  when inserting the code in build settings

 

is it possible to somehow get corona to redownload the notification.v2 plugin

the message below was just a one off , never usually happens after so many failed attempts of building 64-bit

 

 

21:54:59.938  Corona Simulator 2019.3531 (Sep 26 2019 04:20:50)
21:54:59.938  
21:55:00.297  
21:55:00.297  Copyright © 2009-2019  C o r o n a   L a b s   I n c .
21:55:00.297      Version: 3.0.0
21:55:00.297      Build: 2019.3531
21:55:00.359  Platform: SM-G900S / x64 / 6.1 / Intel® Iris™ Pro Graphics 5200 / 4.2.0 - Build 10.18.10.3345 / 2019.3531 / en_GB | GB | en_GB | en
21:55:00.359  Loading project from:   C:\Users\Windows-7\Desktop\New folder\Chains
21:55:00.359  Project sandbox folder: C:\Users\Windows-7\AppData\Local\Corona Labs\Corona Simulator\Sandbox\chains-6478FA8A90099C833F8EDD8A68AF9CC6\Documents
21:55:01.623  PluginSync: plugin com.coronalabs/plugin.notifications.v2 needs to be updated for platform win32-sim to build number: 3060
21:55:01.623  PluginSync: downloading plugin: http://plugins.coronasphere.com/com.coronalabs/plugin.notifications.v2/2017.3060/win32-sim/plugin.notifications.v2.zip



[TOPIC: post.html]
#20

akhtarx5

[GLOBAL: userInfoPane.html]
akhtarx5
  • Enthusiast

  • 86 posts
  • Corona SDK

  Best Answer

thanks so much for all you help

 

managed to get it going, wrong java installed or too many java iterations installed




[topic_controls]
[/topic_controls]